
-- TII03 : INSERT INTO a 3-key table

CREATE TABLE namesXfer (
  id INTEGER PRIMARY KEY
, firstName VARCHAR(30)
, lastName VARCHAR(30)
);
INSERT INTO namesXfer (SELECT * FROM names WHERE lastName IS NOT NULL);
SELECT * FROM namesXfer;
DROP TABLE namesXfer;

CREATE TABLE
INSERT 0 5
ID|FIRSTNAME|LASTNAME
0|Zero|Cool
1|Acid|Burn
2|Cereal|Killer
3|Lord|Nikon
5|Zero|Cool
(5 rows)
DROP TABLE
