
-- TWI09 : OCTO407 : IN operator returns incorrect results when used with LEFT JOIN

SELECT ALL orders.customer_id, orders.order_id, orders.order_date, orders.order_amount FROM orders LEFT JOIN customers ON (orders.order_id = customers.customer_id) WHERE orders.order_amount IN ('$25.50', '$124.00', '$78.50');

select all n1.id,n2.id from names n1 right join names n2 on (n1.firstname = n2.lastname) where n1.id IN (1,2);

CUSTOMER_ID|ORDER_ID|ORDER_DATE|ORDER_AMOUNT
2|3|05/23/1784|$124.00
10|5|07/21/1795|$25.50
3|2|03/14/1760|$78.50
(3 rows)
ID|ID
(0 rows)
;; This is a generated file; do not modify. Generated M code corresponds to below SQL query
;; ---------------------------------------------------------
;  SELECT ALL orders.customer_id, orders.order_id, orders.order_date, orders.order_amount FROM orders LEFT JOIN customers ON (orders.order_id = customers.customer_id) WHERE orders.order_amount IN ('$25.50', '$124.00', '$78.50');
;; ---------------------------------------------------------

octoPlan0(cursorId,wrapInTp)
    DO:'$DATA(^%ydboctoocto("xref_status","ORDERS","ORDER_AMOUNT")) xrefPlan^%ydboctoX2rbmGQx4OtlbPfepALF2EA(cursorId)
    NEW %ydboctog,%ydboctop,%ydboctoexpr
    TSTART:wrapInTp ():(serial)
    DO octoPlan1(cursorId)
    TCOMMIT:wrapInTp
    QUIT

octoPlan1(cursorId)
    NEW %ydboctoz,%ydboctoexpr KILL %ydboctocursor(cursorId,"keys",4,"","")
    NEW %ydboctoin1
    DO
    . SET %ydboctoexpr=$GET(%ydboctocursor(cursorId,"parameters",1))
    SET %ydboctoin1(%ydboctoexpr)=""
    DO
    . SET %ydboctoexpr=$GET(%ydboctocursor(cursorId,"parameters",2))
    SET %ydboctoin1(%ydboctoexpr)=""
    DO
    . SET %ydboctoexpr=$GET(%ydboctocursor(cursorId,"parameters",3))
    SET %ydboctoin1(%ydboctoexpr)=""
    SET %ydboctoin1="" FOR  DO:$DATA(%ydboctoin1(%ydboctoin1))  SET %ydboctoin1=$ORDER(%ydboctoin1(%ydboctoin1)) QUIT:""=%ydboctoin1
    . SET %ydboctoexpr=%ydboctoin1
    . SET %ydboctocursor(cursorId,"keys",1,"ORDERS","ORDER_AMOUNT")=%ydboctoexpr IF '$ZYISSQLNULL(%ydboctocursor(cursorId,"keys",1,"ORDERS","ORDER_AMOUNT")) IF $DATA(^%ydboctoxref("ORDERS","ORDER_AMOUNT",%ydboctocursor(cursorId,"keys",1,"ORDERS","ORDER_AMOUNT"))) DO
    . . SET %ydboctocursor(cursorId,"keys",1,"ORDERS","ORDER_ID")=""
    . . FOR  SET %ydboctocursor(cursorId,"keys",1,"ORDERS","ORDER_ID")=$ORDER(^%ydboctoxref("ORDERS","ORDER_AMOUNT",%ydboctocursor(cursorId,"keys",1,"ORDERS","ORDER_AMOUNT"),%ydboctocursor(cursorId,"keys",1,"ORDERS","ORDER_ID"))) QUIT:(%ydboctocursor(cursorId,"keys",1,"ORDERS","ORDER_ID")="")  DO
    . . . SET %ydboctoz(2)=0
    . . . SET %ydboctoexpr=%ydboctocursor(cursorId,"keys",1,"ORDERS","ORDER_ID")
    . . . SET %ydboctocursor(cursorId,"keys",2,"CUSTOMERS","CUSTOMER_ID")=%ydboctoexpr IF '$ZYISSQLNULL(%ydboctocursor(cursorId,"keys",2,"CUSTOMERS","CUSTOMER_ID")) IF $DATA(^customers(%ydboctocursor(cursorId,"keys",2,"CUSTOMERS","CUSTOMER_ID"))) DO
    . . . . SET %ydboctoz(2)=1
    . . . . SET %ydboctoexpr=1
    . . . . SET %ydboctoexpr(1)=0
    . . . . SET %ydboctoexpr=%ydboctocursor(cursorId,"keys",1,"ORDERS","ORDER_AMOUNT")
    . . . . SET %ydboctoexpr(1,0)=%ydboctoexpr
    . . . . SET %ydboctoexpr=$GET(%ydboctocursor(cursorId,"parameters",1))
    . . . . SET %ydboctoexpr(1,1)=%ydboctoexpr
    . . . . SET %ydboctoexpr(1)=%ydboctoexpr(1)!(%ydboctoexpr(1,0)=%ydboctoexpr(1,1))
    . . . . SET %ydboctoexpr=$GET(%ydboctocursor(cursorId,"parameters",2))
    . . . . SET %ydboctoexpr(1,1)=%ydboctoexpr
    . . . . SET %ydboctoexpr(1)=%ydboctoexpr(1)!(%ydboctoexpr(1,0)=%ydboctoexpr(1,1))
    . . . . SET %ydboctoexpr=$GET(%ydboctocursor(cursorId,"parameters",3))
    . . . . SET %ydboctoexpr(1,1)=%ydboctoexpr
    . . . . SET %ydboctoexpr(1)=%ydboctoexpr(1)!(%ydboctoexpr(1,0)=%ydboctoexpr(1,1))
    . . . . SET %ydboctoexpr=%ydboctoexpr(1)
    . . . . DO:%ydboctoexpr
    . . . . . SET:1&$INCREMENT(%ydboctocursor(cursorId,"keys",4,"","")) %ydboctoz=42
    . . . . . SET %ydboctoexpr=$PIECE($GET(^orders(%ydboctocursor(cursorId,"keys",1,"ORDERS","ORDER_ID"))),"|",3) SET:(""=%ydboctoexpr) %ydboctoexpr=$ZYSQLNULL
    . . . . . SET %ydboctoexpr=$$str2mval^%ydboctoplanhelpers(%ydboctoexpr)
    . . . . . SET %ydboctoexpr(0)=%ydboctoexpr
    . . . . . SET %ydboctoexpr=%ydboctocursor(cursorId,"keys",1,"ORDERS","ORDER_ID")
    . . . . . SET %ydboctoexpr=$$str2mval^%ydboctoplanhelpers(%ydboctoexpr)
    . . . . . SET %ydboctoexpr=%ydboctoexpr(0)_%ydboctoexpr
    . . . . . SET %ydboctoexpr(0)=%ydboctoexpr
    . . . . . SET %ydboctoexpr=$PIECE($GET(^orders(%ydboctocursor(cursorId,"keys",1,"ORDERS","ORDER_ID"))),"|",1) SET:(""=%ydboctoexpr) %ydboctoexpr=$ZYSQLNULL
    . . . . . SET %ydboctoexpr=$$str2mval^%ydboctoplanhelpers(%ydboctoexpr)
    . . . . . SET %ydboctoexpr=%ydboctoexpr(0)_%ydboctoexpr
    . . . . . SET %ydboctoexpr(0)=%ydboctoexpr
    . . . . . SET %ydboctoexpr=%ydboctocursor(cursorId,"keys",1,"ORDERS","ORDER_AMOUNT")
    . . . . . SET %ydboctoexpr=$$str2mval^%ydboctoplanhelpers(%ydboctoexpr)
    . . . . . SET %ydboctoexpr=%ydboctoexpr(0)_%ydboctoexpr
    . . . . . SET %ydboctocursor(cursorId,"keys",4,"","",%ydboctocursor(cursorId,"keys",4,"",""))=%ydboctoexpr
    . . . DO:0=%ydboctoz(2)
    . . . . SET %ydboctoexpr=1
    . . . . SET %ydboctoexpr(1)=0
    . . . . SET %ydboctoexpr=%ydboctocursor(cursorId,"keys",1,"ORDERS","ORDER_AMOUNT")
    . . . . SET %ydboctoexpr(1,0)=%ydboctoexpr
    . . . . SET %ydboctoexpr=$GET(%ydboctocursor(cursorId,"parameters",1))
    . . . . SET %ydboctoexpr(1,1)=%ydboctoexpr
    . . . . SET %ydboctoexpr(1)=%ydboctoexpr(1)!(%ydboctoexpr(1,0)=%ydboctoexpr(1,1))
    . . . . SET %ydboctoexpr=$GET(%ydboctocursor(cursorId,"parameters",2))
    . . . . SET %ydboctoexpr(1,1)=%ydboctoexpr
    . . . . SET %ydboctoexpr(1)=%ydboctoexpr(1)!(%ydboctoexpr(1,0)=%ydboctoexpr(1,1))
    . . . . SET %ydboctoexpr=$GET(%ydboctocursor(cursorId,"parameters",3))
    . . . . SET %ydboctoexpr(1,1)=%ydboctoexpr
    . . . . SET %ydboctoexpr(1)=%ydboctoexpr(1)!(%ydboctoexpr(1,0)=%ydboctoexpr(1,1))
    . . . . SET %ydboctoexpr=%ydboctoexpr(1)
    . . . . DO:%ydboctoexpr
    . . . . . SET:1&$INCREMENT(%ydboctocursor(cursorId,"keys",4,"","")) %ydboctoz=42
    . . . . . SET %ydboctoexpr=$PIECE($GET(^orders(%ydboctocursor(cursorId,"keys",1,"ORDERS","ORDER_ID"))),"|",3) SET:(""=%ydboctoexpr) %ydboctoexpr=$ZYSQLNULL
    . . . . . SET %ydboctoexpr=$$str2mval^%ydboctoplanhelpers(%ydboctoexpr)
    . . . . . SET %ydboctoexpr(0)=%ydboctoexpr
    . . . . . SET %ydboctoexpr=%ydboctocursor(cursorId,"keys",1,"ORDERS","ORDER_ID")
    . . . . . SET %ydboctoexpr=$$str2mval^%ydboctoplanhelpers(%ydboctoexpr)
    . . . . . SET %ydboctoexpr=%ydboctoexpr(0)_%ydboctoexpr
    . . . . . SET %ydboctoexpr(0)=%ydboctoexpr
    . . . . . SET %ydboctoexpr=$PIECE($GET(^orders(%ydboctocursor(cursorId,"keys",1,"ORDERS","ORDER_ID"))),"|",1) SET:(""=%ydboctoexpr) %ydboctoexpr=$ZYSQLNULL
    . . . . . SET %ydboctoexpr=$$str2mval^%ydboctoplanhelpers(%ydboctoexpr)
    . . . . . SET %ydboctoexpr=%ydboctoexpr(0)_%ydboctoexpr
    . . . . . SET %ydboctoexpr(0)=%ydboctoexpr
    . . . . . SET %ydboctoexpr=%ydboctocursor(cursorId,"keys",1,"ORDERS","ORDER_AMOUNT")
    . . . . . SET %ydboctoexpr=$$str2mval^%ydboctoplanhelpers(%ydboctoexpr)
    . . . . . SET %ydboctoexpr=%ydboctoexpr(0)_%ydboctoexpr
    . . . . . SET %ydboctocursor(cursorId,"keys",4,"","",%ydboctocursor(cursorId,"keys",4,"",""))=%ydboctoexpr
    QUIT
;; This is a generated file; do not modify. Generated M code corresponds to below SQL query
;; ---------------------------------------------------------
;  select all n1.id,n2.id from names n1 right join names n2 on (n1.firstname = n2.lastname) where n1.id IN (1,2);
;; ---------------------------------------------------------

octoPlan0(cursorId,wrapInTp)
    DO:'$DATA(^%ydboctoocto("xref_status","NAMES","LASTNAME")) xrefPlan^%ydboctoXOMMMsQ8ks3NI1C42wS8F05(cursorId)
    NEW %ydboctog,%ydboctop,%ydboctoexpr
    TSTART:wrapInTp ():(serial)
    DO octoPlan1(cursorId)
    TCOMMIT:wrapInTp
    QUIT

octoPlan1(cursorId)
    NEW %ydboctoz,%ydboctoexpr KILL %ydboctocursor(cursorId,"keys",4,"","")
    NEW %ydboctoin1
    DO
    . SET %ydboctoexpr=$GET(%ydboctocursor(cursorId,"parameters",1))
    SET %ydboctoin1(%ydboctoexpr)=""
    DO
    . SET %ydboctoexpr=$GET(%ydboctocursor(cursorId,"parameters",2))
    SET %ydboctoin1(%ydboctoexpr)=""
    SET %ydboctoin1="" FOR  DO:$DATA(%ydboctoin1(%ydboctoin1))  SET %ydboctoin1=$ORDER(%ydboctoin1(%ydboctoin1)) QUIT:""=%ydboctoin1
    . SET %ydboctoexpr=%ydboctoin1
    . SET %ydboctocursor(cursorId,"keys",1,"NAMES","ID")=%ydboctoexpr IF '$ZYISSQLNULL(%ydboctocursor(cursorId,"keys",1,"NAMES","ID")) IF $DATA(^names(%ydboctocursor(cursorId,"keys",1,"NAMES","ID"))) DO
    . . SET %ydboctoexpr=$PIECE($GET(^names(%ydboctocursor(cursorId,"keys",1,"NAMES","ID"))),"|",1) SET:(""=%ydboctoexpr) %ydboctoexpr=$ZYSQLNULL
    . . SET %ydboctocursor(cursorId,"keys",2,"NAMES","LASTNAME")=%ydboctoexpr IF '$ZYISSQLNULL(%ydboctocursor(cursorId,"keys",2,"NAMES","LASTNAME")) IF $DATA(^%ydboctoxref("NAMES","LASTNAME",%ydboctocursor(cursorId,"keys",2,"NAMES","LASTNAME"))) DO
    . . . SET %ydboctocursor(cursorId,"keys",2,"NAMES","ID")=""
    . . . FOR  SET %ydboctocursor(cursorId,"keys",2,"NAMES","ID")=$ORDER(^%ydboctoxref("NAMES","LASTNAME",%ydboctocursor(cursorId,"keys",2,"NAMES","LASTNAME"),%ydboctocursor(cursorId,"keys",2,"NAMES","ID"))) QUIT:(%ydboctocursor(cursorId,"keys",2,"NAMES","ID")="")  DO
    . . . . SET %ydboctoz(1,%ydboctocursor(cursorId,"keys",2,"NAMES","ID"))=""
    . . . . SET %ydboctoexpr=1
    . . . . SET %ydboctoexpr(1)=0
    . . . . SET %ydboctoexpr=%ydboctocursor(cursorId,"keys",1,"NAMES","ID")
    . . . . SET %ydboctoexpr(1,0)=%ydboctoexpr
    . . . . SET %ydboctoexpr=$GET(%ydboctocursor(cursorId,"parameters",1))
    . . . . SET %ydboctoexpr(1,1)=%ydboctoexpr
    . . . . SET %ydboctoexpr(1)=%ydboctoexpr(1)!($$ForceNumeric^%ydboctoplanhelpers(%ydboctoexpr(1,0))=$$ForceNumeric^%ydboctoplanhelpers(%ydboctoexpr(1,1)))
    . . . . SET %ydboctoexpr=$GET(%ydboctocursor(cursorId,"parameters",2))
    . . . . SET %ydboctoexpr(1,1)=%ydboctoexpr
    . . . . SET %ydboctoexpr(1)=%ydboctoexpr(1)!($$ForceNumeric^%ydboctoplanhelpers(%ydboctoexpr(1,0))=$$ForceNumeric^%ydboctoplanhelpers(%ydboctoexpr(1,1)))
    . . . . SET %ydboctoexpr=%ydboctoexpr(1)
    . . . . DO:%ydboctoexpr
    . . . . . SET:1&$INCREMENT(%ydboctocursor(cursorId,"keys",4,"","")) %ydboctoz=42
    . . . . . SET %ydboctoexpr=%ydboctocursor(cursorId,"keys",1,"NAMES","ID")
    . . . . . SET %ydboctoexpr=$$str2mval^%ydboctoplanhelpers(%ydboctoexpr)
    . . . . . SET %ydboctoexpr(0)=%ydboctoexpr
    . . . . . SET %ydboctoexpr=%ydboctocursor(cursorId,"keys",2,"NAMES","ID")
    . . . . . SET %ydboctoexpr=$$str2mval^%ydboctoplanhelpers(%ydboctoexpr)
    . . . . . SET %ydboctoexpr=%ydboctoexpr(0)_%ydboctoexpr
    . . . . . SET %ydboctocursor(cursorId,"keys",4,"","",%ydboctocursor(cursorId,"keys",4,"",""))=%ydboctoexpr
    SET %ydboctocursor(cursorId,"keys",2,"NAMES","ID")=""
    FOR  SET %ydboctocursor(cursorId,"keys",2,"NAMES","ID")=$ORDER(^names(%ydboctocursor(cursorId,"keys",2,"NAMES","ID"))) QUIT:(%ydboctocursor(cursorId,"keys",2,"NAMES","ID")="")  DO
    . DO:'$DATA(%ydboctoz(1,%ydboctocursor(cursorId,"keys",2,"NAMES","ID")))
    . . SET %ydboctoexpr=1
    . . SET %ydboctoexpr(1)=0
    . . SET %ydboctoexpr=$ZYSQLNULL
    . . SET %ydboctoexpr(1,0)=%ydboctoexpr
    . . SET %ydboctoexpr=$GET(%ydboctocursor(cursorId,"parameters",1))
    . . SET %ydboctoexpr(1,1)=%ydboctoexpr
    . . SET %ydboctoexpr(1)=%ydboctoexpr(1)!($$ForceNumeric^%ydboctoplanhelpers(%ydboctoexpr(1,0))=$$ForceNumeric^%ydboctoplanhelpers(%ydboctoexpr(1,1)))
    . . SET %ydboctoexpr=$GET(%ydboctocursor(cursorId,"parameters",2))
    . . SET %ydboctoexpr(1,1)=%ydboctoexpr
    . . SET %ydboctoexpr(1)=%ydboctoexpr(1)!($$ForceNumeric^%ydboctoplanhelpers(%ydboctoexpr(1,0))=$$ForceNumeric^%ydboctoplanhelpers(%ydboctoexpr(1,1)))
    . . SET %ydboctoexpr=%ydboctoexpr(1)
    . . DO:%ydboctoexpr
    . . . SET:1&$INCREMENT(%ydboctocursor(cursorId,"keys",4,"","")) %ydboctoz=42
    . . . SET %ydboctoexpr=$ZYSQLNULL
    . . . SET %ydboctoexpr=$$str2mval^%ydboctoplanhelpers(%ydboctoexpr)
    . . . SET %ydboctoexpr(0)=%ydboctoexpr
    . . . SET %ydboctoexpr=%ydboctocursor(cursorId,"keys",2,"NAMES","ID")
    . . . SET %ydboctoexpr=$$str2mval^%ydboctoplanhelpers(%ydboctoexpr)
    . . . SET %ydboctoexpr=%ydboctoexpr(0)_%ydboctoexpr
    . . . SET %ydboctocursor(cursorId,"keys",4,"","",%ydboctocursor(cursorId,"keys",4,"",""))=%ydboctoexpr
    QUIT
