
-- TVD0005 : Test Realistic Sample Query 2
select * from BLOCK where PRE_ACTION is not NULL;

BLOCK_ID|NAME|DATA_DICTIONARY_NUMBER|DISABLE_NAVIGATION|PRE_ACTION|POST_ACTION
.00111|DICATTW2|1||D WORD^DICATTD0(23)|
.10012|DIPTED2|.4||D EDIT^DIPTED(DA)|
.11025|DIKC EDIT UI FIELD CRV|.114||K DIKCCRV|I $D(DIKCCRV) D BLDLOG^DIKCFORM(DA(1)) K DIKCCRV
.310106|DIKK EDIT UNIQUENESS INDEX|.31||D:$$GET^DDSVAL(.31,DA,3)="" UNED^DDSUTL("DETAILS","","",1)|
.400012|DIBTED2|.401||D EDIT^DIBTED(DA)|
.402011|DIEDIT|1||D PRE^DIU20|
.403011|DDGF BLOCK EDIT 1|.4032||I $$GET^DDSVAL(DIE,.DA,3)="d" D UNED^DDSUTL("DISABLE NAVIGATION","DDGF BLOCK EDIT 2","",1)|
.403013|DDGF BLOCK EDIT OTHER|.4032||I $$GET^DDSVAL(DIE,.DA,"REPLICATION")<2 N DDGFZ F DDGFZ="INDEX","INITIAL POSITION","DISALLOW LAYGO","FIELD FOR SELECTION","ASK 'OK'","COMPUTED MULTIPLE","COMPUTED MUL PTR" D UNED^DDSUTL(DDGFZ,"","",1)|
23|XUDEVICE HFS|3.5||D UNED^DDSUTL("Alt $I",,,'$P(^XTV(8989.3,1,0),U,5))|
59|XPD EDIT BUILD6|9.4||I $G(XPDBR) S DDSBR="COM" K XPDBR|
167|ENPRMS2|6925||S ENPR=$$GET^DDSVAL(6925,DA,155) D HLP^DDSUTL("Milestones not applicable to this project are followed by '(NA)' and will not be sent to VACO")|K ENPR
168|ENPRBASE|6925||D BASEPR^ENPROJF|K ENFT,ENPR,ENCPI
172|ENPRMS1|6925||D HLP^DDSUTL("Milestones not applicable to this project are followed by '(NA)' and will not be sent to VACO")|
225|WV PROC-EDITBLK-1|790.1||D:$$COLP^WVUTL4(DA) HLP^DDSUTL(" * Move to PAGE 2 to edit clinical and pathology findings. ")|
230|WV NOTIF-EDITBLK-2|790.4||D HLP^DDSUTL("*** NOTE: Most fields cannot be edited because the letter has been printed. ***")|
342|XUEXISTING USER NAME COMPONENT|20||I $G(XLFNCHG),$D(XLFNC) N FLD,NC,SUB M NC=XLFNC K XLFNC S (XLFNAME,XLFNEW)=NC K XLFNCHG S FLD=0 F SUB="FAMILY","GIVEN","MIDDLE","","SUFFIX" S FLD=FLD+1 D:SUB]"" PUT^DDSVAL(DIE,DA,FLD,$G(NC(SUB)),"","I")|
373|XUDEVICE TRM|3.5||D UNED^DDSUTL("Alt $I",,,'$P(^XTV(8989.3,1,0),U,5))|
464|TIME SEGMENT|451.9999||S:$O(PRSNPC(""))]"" DDSCHG=1|
(18 rows)
