
-- TCF021 : OCTO345 : Maximum number of arguments accepted

CREATE FUNCTION MAXARGS(INTEGER, INTEGER, INTEGER, INTEGER, INTEGER, INTEGER, INTEGER, INTEGER, INTEGER, INTEGER, INTEGER, INTEGER, INTEGER, INTEGER, INTEGER, INTEGER, INTEGER, INTEGER, INTEGER, INTEGER, INTEGER, INTEGER, INTEGER, INTEGER, INTEGER, INTEGER, INTEGER, INTEGER, INTEGER, INTEGER, INTEGER, INTEGER) RETURNS NUMERIC AS $$^MAXARGS;
SELECT MAXARGS(1, 2, 3, 4, 5, 6, 7, 8, 9, 10, 11, 12, 13, 14, 15, 16, 17, 18, 19, 20, 21, 22, 23, 24, 25, 26, 27, 28, 29, 30, 31, id) FROM names;

CREATE FUNCTION
MAXARGS
496
497
498
499
500
501
(6 rows)
