
-- TWI04 : where IN references parent from SET expression

SELECT *
FROM names a
WHERE a.firstName IN (
    SELECT b.firstName
    FROM names b
    WHERE b.id = a.id

    UNION ALL

    SELECT c.firstName
    FROM names c
    WHERE c.id = a.id
);

ID|FIRSTNAME|LASTNAME
0|Zero|Cool
1|Acid|Burn
2|Cereal|Killer
3|Lord|Nikon
4|Joey|
5|Zero|Cool
(6 rows)
;; This is a generated file; do not modify. Generated M code corresponds to below SQL query
;; ---------------------------------------------------------
;  SELECT *
;  FROM names a
;  WHERE a.firstName IN (
;      SELECT b.firstName
;      FROM names b
;      WHERE b.id = a.id
;  
;      UNION ALL
;  
;      SELECT c.firstName
;      FROM names c
;      WHERE c.id = a.id
;  );
;; ---------------------------------------------------------

octoPlan0(cursorId,wrapInTp)
    NEW %ydboctog,%ydboctop,%ydboctoexpr
    TSTART:wrapInTp ():(serial)
    DO octoPlan1(cursorId)
    TCOMMIT:wrapInTp
    QUIT

octoPlan1(cursorId)
    NEW %ydboctoz,%ydboctoexpr KILL %ydboctocursor(cursorId,"keys",10,"","")
    SET %ydboctocursor(cursorId,"keys",1,"NAMES","ID")=""
    FOR  SET %ydboctocursor(cursorId,"keys",1,"NAMES","ID")=$ORDER(^names(%ydboctocursor(cursorId,"keys",1,"NAMES","ID"))) QUIT:(%ydboctocursor(cursorId,"keys",1,"NAMES","ID")="")  DO
    . SET %ydboctoexpr=1
    . SET %ydboctoexpr=$PIECE($GET(^names(%ydboctocursor(cursorId,"keys",1,"NAMES","ID"))),"|",1) SET:(""=%ydboctoexpr) %ydboctoexpr=$ZYSQLNULL
    . SET %ydboctoexpr(1)=%ydboctoexpr
    . SET %ydboctoexpr=$SELECT($ZYISSQLNULL(%ydboctoexpr(1)):$ZYSQLNULL,$$InvokeOctoPlan^%ydboctoplanhelpers("octoPlan2,"):0,$$InvokeOctoPlan^%ydboctoplanhelpers("octoPlan3,"):0,$$InvokeSetOper^%ydboctoplanhelpers(7,8,9,"columnkeyUNIONALL"):0,$DATA(%ydboctocursor(cursorId,"keys",9,"","",%ydboctoexpr(1))):1,$DATA(%ydboctocursor(cursorId,"keys",9,"","",$ZYSQLNULL)):$ZYSQLNULL,1:0)
    . DO:%ydboctoexpr
    . . SET:1&$INCREMENT(%ydboctocursor(cursorId,"keys",10,"","")) %ydboctoz=42
    . . SET %ydboctoexpr=%ydboctocursor(cursorId,"keys",1,"NAMES","ID")
    . . SET %ydboctoexpr=$$str2mval^%ydboctoplanhelpers(%ydboctoexpr)
    . . SET %ydboctoexpr(0)=%ydboctoexpr
    . . SET %ydboctoexpr=$PIECE($GET(^names(%ydboctocursor(cursorId,"keys",1,"NAMES","ID"))),"|",1) SET:(""=%ydboctoexpr) %ydboctoexpr=$ZYSQLNULL
    . . SET %ydboctoexpr=$$str2mval^%ydboctoplanhelpers(%ydboctoexpr)
    . . SET %ydboctoexpr=%ydboctoexpr(0)_%ydboctoexpr
    . . SET %ydboctoexpr(0)=%ydboctoexpr
    . . SET %ydboctoexpr=$PIECE($GET(^names(%ydboctocursor(cursorId,"keys",1,"NAMES","ID"))),"|",2) SET:(""=%ydboctoexpr) %ydboctoexpr=$ZYSQLNULL
    . . SET %ydboctoexpr=$$str2mval^%ydboctoplanhelpers(%ydboctoexpr)
    . . SET %ydboctoexpr=%ydboctoexpr(0)_%ydboctoexpr
    . . SET %ydboctocursor(cursorId,"keys",10,"","",%ydboctocursor(cursorId,"keys",10,"",""))=%ydboctoexpr
    QUIT

octoPlan2(cursorId)
    NEW %ydboctoz,%ydboctoexpr KILL %ydboctocursor(cursorId,"keys",7,"","")
    DO
    . SET %ydboctoexpr=%ydboctocursor(cursorId,"keys",1,"NAMES","ID")
    SET %ydboctocursor(cursorId,"keys",2,"NAMES","ID")=%ydboctoexpr IF '$ZYISSQLNULL(%ydboctocursor(cursorId,"keys",2,"NAMES","ID")) IF $DATA(^names(%ydboctocursor(cursorId,"keys",2,"NAMES","ID"))) DO
    . SET %ydboctoexpr=1
    . DO:%ydboctoexpr
    . . SET %ydboctoexpr=$PIECE($GET(^names(%ydboctocursor(cursorId,"keys",2,"NAMES","ID"))),"|",1) SET:(""=%ydboctoexpr) %ydboctoexpr=$ZYSQLNULL
    . . IF $INCREMENT(%ydboctocursor(cursorId,"keys",7,"","",%ydboctoexpr))
    QUIT

octoPlan3(cursorId)
    NEW %ydboctoz,%ydboctoexpr KILL %ydboctocursor(cursorId,"keys",8,"","")
    DO
    . SET %ydboctoexpr=%ydboctocursor(cursorId,"keys",1,"NAMES","ID")
    SET %ydboctocursor(cursorId,"keys",4,"NAMES","ID")=%ydboctoexpr IF '$ZYISSQLNULL(%ydboctocursor(cursorId,"keys",4,"NAMES","ID")) IF $DATA(^names(%ydboctocursor(cursorId,"keys",4,"NAMES","ID"))) DO
    . SET %ydboctoexpr=1
    . DO:%ydboctoexpr
    . . SET %ydboctoexpr=$PIECE($GET(^names(%ydboctocursor(cursorId,"keys",4,"NAMES","ID"))),"|",1) SET:(""=%ydboctoexpr) %ydboctoexpr=$ZYSQLNULL
    . . IF $INCREMENT(%ydboctocursor(cursorId,"keys",8,"","",%ydboctoexpr))
    QUIT
