%ydboctoerrcodemax=1073741832
%ydboctoerrcodemax=1073741832
%ydboctoerrcodemax=1073741832
%ydboctoerrcodemin=1073741824
%ydboctoerrcodemin=1073741824
%ydboctoerrcodemin=1073741824
%ydboctoerror("DUPLICATEKEYVALUE")=1073741830
%ydboctoerror("DUPLICATEKEYVALUE")=1073741830
%ydboctoerror("DUPLICATEKEYVALUE")=1073741830
%ydboctoerror("INVALIDESCAPEPATTERN")=1073741827
%ydboctoerror("INVALIDESCAPEPATTERN")=1073741827
%ydboctoerror("INVALIDESCAPEPATTERN")=1073741827
%ydboctoerror("INVALIDINPUTSYNTAXBOOL")=1073741826
%ydboctoerror("INVALIDINPUTSYNTAXBOOL")=1073741826
%ydboctoerror("INVALIDINPUTSYNTAXBOOL")=1073741826
%ydboctoerror("NULLKEYVALUE")=1073741831
%ydboctoerror("NULLKEYVALUE")=1073741831
%ydboctoerror("NULLKEYVALUE")=1073741831
%ydboctoerror("NUMERICOVERFLOW")=1073741828
%ydboctoerror("NUMERICOVERFLOW")=1073741828
%ydboctoerror("NUMERICOVERFLOW")=1073741828
%ydboctoerror("SUBQUERYMULTIPLEROWS")=1073741825
%ydboctoerror("SUBQUERYMULTIPLEROWS")=1073741825
%ydboctoerror("SUBQUERYMULTIPLEROWS")=1073741825
%ydboctoerror("VARCHARTOOLONG")=1073741829
%ydboctoerror("VARCHARTOOLONG")=1073741829
%ydboctoerror("VARCHARTOOLONG")=1073741829
%ydboctosession("user")="USER"
%ydboctosession("user")="USER"
%ydboctosession("user")="USER"
%ydboctosession(1,"bound","","col_formats")=0
%ydboctosession(1,"bound","","col_formats")=0
%ydboctosession(1,"bound","","col_formats")=0
%ydboctosession(1,"bound","","col_formats",1)=0
%ydboctosession(1,"bound","","col_formats",1)=0
%ydboctosession(1,"bound","","col_formats",1)=0
%ydboctosession(1,"bound","","parameters")=0
%ydboctosession(1,"bound","","parameters")=0
%ydboctosession(1,"bound","","parameters")=0
%ydboctosession(1,"bound","","parameters","all")=1
%ydboctosession(1,"bound","","parameters","all")=1
%ydboctosession(1,"bound","","parameters","all")=1
%ydboctosession(1,"bound","","parameters","all",1)=101
%ydboctosession(1,"bound","","parameters","all",1)=3
%ydboctosession(1,"bound","","parameters","all",1)=3
%ydboctosession(1,"bound","","routine")="%ydboctoP0aAvKvwwBCEat2OnmxhCCF"
%ydboctosession(1,"bound","","routine")="%ydboctoP0aAvKvwwBCEat2OnmxhCCF"
%ydboctosession(1,"bound","","routine")="%ydboctoP3zuDoHPb0kqFYTJ1BrAWJB"
%ydboctosession(1,"bound","","tag")=2
%ydboctosession(1,"bound","","tag")=2
%ydboctosession(1,"bound","","tag")=2
%ydboctosession(1,"prepared","")="SELECT * FROM OrderDetails WHERE OrderDetailID = 101"
%ydboctosession(1,"prepared","")="SELECT * FROM OrderDetails WHERE OrderDetailID = 3"
%ydboctosession(1,"prepared","")="SELECT * FROM Shippers WHERE ShipperID = 3"
%ydboctosession(1,"prepared","","parameters")=0
%ydboctosession(1,"prepared","","parameters")=0
%ydboctosession(1,"prepared","","parameters")=0
%ydboctosession(1,"prepared","","parameters","all")=1
%ydboctosession(1,"prepared","","parameters","all")=1
%ydboctosession(1,"prepared","","parameters","all")=1
%ydboctosession(1,"prepared","","parameters","all",1)=101
%ydboctosession(1,"prepared","","parameters","all",1)=3
%ydboctosession(1,"prepared","","parameters","all",1)=3
%ydboctosession(1,"prepared","","routine")="%ydboctoP0aAvKvwwBCEat2OnmxhCCF"
%ydboctosession(1,"prepared","","routine")="%ydboctoP0aAvKvwwBCEat2OnmxhCCF"
%ydboctosession(1,"prepared","","routine")="%ydboctoP3zuDoHPb0kqFYTJ1BrAWJB"
%ydboctosession(1,"prepared","","tag")=2
%ydboctosession(1,"prepared","","tag")=2
%ydboctosession(1,"prepared","","tag")=2
%ydboctosession=1
%ydboctosession=1
%ydboctosession=1
