# Run an UPDATE query and a SELECT query to verify the UPDATE worked
UPDATE 3
ID|FIRSTNAME|LASTNAME
0|Zero|Cool
1|Acid#|Burn
2|Cereal#|Killer
3|Lord#|Nikon
4|Joey|
5|Zero|Cool
(6 rows)
# Turn off write permissions in the current directory (thereby preventing physical plans from being deleted/created)
# Rerun the UPDATE and SELECT query to verify no new physical plans get created
UPDATE 3
ID|FIRSTNAME|LASTNAME
0|Zero|Cool
1|Acid##|Burn
2|Cereal##|Killer
3|Lord##|Nikon
4|Joey|
5|Zero|Cool
(6 rows)
# We expect no errors confirming that UPDATE plans get reused once generated
# Turn write permissions back on in the current directory
