ID|FIRSTNAME|LASTNAME
2|Cereal|Killer
0|Zero|Cool
5|Zero|Cool
(3 rows)
;; This is a generated file; do not modify. Generated M code corresponds to below SQL query
;; ---------------------------------------------------------
;  select * from names where id = 2 or firstName = "Zero";
;; ---------------------------------------------------------

octoPlan0(cursorId,wrapInTp)
    DO:'$DATA(^%ydboctoocto("xref_status","NAMES","FIRSTNAME")) xrefPlan^%ydboctoXS6loYoNNto55iv2lHkNkCK(cursorId)
    NEW %ydboctog,%ydboctop,%ydboctoexpr
    TSTART:wrapInTp ():(serial)
    DO octoPlan1(cursorId)
    DO octoPlan2(cursorId)
    TCOMMIT:wrapInTp
    QUIT

octoPlan1(cursorId)
    NEW %ydboctoz,%ydboctoexpr KILL %ydboctocursor(cursorId,"keys",3,"","")
    DO
    . SET %ydboctoexpr=$GET(%ydboctocursor(cursorId,"parameters",1))
    SET %ydboctocursor(cursorId,"keys",1,"NAMES","ID")=%ydboctoexpr IF '$ZYISSQLNULL(%ydboctocursor(cursorId,"keys",1,"NAMES","ID")) IF $DATA(^names(%ydboctocursor(cursorId,"keys",1,"NAMES","ID"))) DO
    . DO:'$DATA(%ydboctozduplicate(3,%ydboctocursor(cursorId,"keys",1,"NAMES","ID")))
    . . SET %ydboctoexpr=1
    . . DO:%ydboctoexpr
    . . . SET:1&$INCREMENT(%ydboctocursor(cursorId,"keys",3,"","")) %ydboctoz=42
    . . . SET %ydboctoexpr=%ydboctocursor(cursorId,"keys",1,"NAMES","ID")
    . . . SET %ydboctoexpr=$$str2mval^%ydboctoplanhelpers(%ydboctoexpr)
    . . . SET %ydboctoexpr(0)=%ydboctoexpr
    . . . SET %ydboctoexpr=$PIECE($GET(^names(%ydboctocursor(cursorId,"keys",1,"NAMES","ID"))),"|",1) SET:(""=%ydboctoexpr) %ydboctoexpr=$ZYSQLNULL
    . . . SET %ydboctoexpr=$$str2mval^%ydboctoplanhelpers(%ydboctoexpr)
    . . . SET %ydboctoexpr=%ydboctoexpr(0)_%ydboctoexpr
    . . . SET %ydboctoexpr(0)=%ydboctoexpr
    . . . SET %ydboctoexpr=$PIECE($GET(^names(%ydboctocursor(cursorId,"keys",1,"NAMES","ID"))),"|",2) SET:(""=%ydboctoexpr) %ydboctoexpr=$ZYSQLNULL
    . . . SET %ydboctoexpr=$$str2mval^%ydboctoplanhelpers(%ydboctoexpr)
    . . . SET %ydboctoexpr=%ydboctoexpr(0)_%ydboctoexpr
    . . . SET %ydboctocursor(cursorId,"keys",3,"","",%ydboctocursor(cursorId,"keys",3,"",""))=%ydboctoexpr
    . . . SET %ydboctozduplicate(3,%ydboctocursor(cursorId,"keys",1,"NAMES","ID"))=""
    QUIT

octoPlan2(cursorId)
    NEW %ydboctoz,%ydboctoexpr
    DO
    . SET %ydboctoexpr=$GET(%ydboctocursor(cursorId,"parameters",2))
    SET %ydboctocursor(cursorId,"keys",1,"NAMES","FIRSTNAME")=%ydboctoexpr IF '$ZYISSQLNULL(%ydboctocursor(cursorId,"keys",1,"NAMES","FIRSTNAME")) IF $DATA(^%ydboctoxref("NAMES","FIRSTNAME",%ydboctocursor(cursorId,"keys",1,"NAMES","FIRSTNAME"))) DO
    . SET %ydboctocursor(cursorId,"keys",1,"NAMES","ID")=""
    . FOR  SET %ydboctocursor(cursorId,"keys",1,"NAMES","ID")=$ORDER(^%ydboctoxref("NAMES","FIRSTNAME",%ydboctocursor(cursorId,"keys",1,"NAMES","FIRSTNAME"),%ydboctocursor(cursorId,"keys",1,"NAMES","ID"))) QUIT:(%ydboctocursor(cursorId,"keys",1,"NAMES","ID")="")  DO
    . . DO:'$DATA(%ydboctozduplicate(3,%ydboctocursor(cursorId,"keys",1,"NAMES","ID")))
    . . . SET %ydboctoexpr=1
    . . . DO:%ydboctoexpr
    . . . . SET:1&$INCREMENT(%ydboctocursor(cursorId,"keys",3,"","")) %ydboctoz=42
    . . . . SET %ydboctoexpr=%ydboctocursor(cursorId,"keys",1,"NAMES","ID")
    . . . . SET %ydboctoexpr=$$str2mval^%ydboctoplanhelpers(%ydboctoexpr)
    . . . . SET %ydboctoexpr(0)=%ydboctoexpr
    . . . . SET %ydboctoexpr=%ydboctocursor(cursorId,"keys",1,"NAMES","FIRSTNAME")
    . . . . SET %ydboctoexpr=$$str2mval^%ydboctoplanhelpers(%ydboctoexpr)
    . . . . SET %ydboctoexpr=%ydboctoexpr(0)_%ydboctoexpr
    . . . . SET %ydboctoexpr(0)=%ydboctoexpr
    . . . . SET %ydboctoexpr=$PIECE($GET(^names(%ydboctocursor(cursorId,"keys",1,"NAMES","ID"))),"|",2) SET:(""=%ydboctoexpr) %ydboctoexpr=$ZYSQLNULL
    . . . . SET %ydboctoexpr=$$str2mval^%ydboctoplanhelpers(%ydboctoexpr)
    . . . . SET %ydboctoexpr=%ydboctoexpr(0)_%ydboctoexpr
    . . . . SET %ydboctocursor(cursorId,"keys",3,"","",%ydboctocursor(cursorId,"keys",3,"",""))=%ydboctoexpr
    . . . . SET %ydboctozduplicate(3,%ydboctocursor(cursorId,"keys",1,"NAMES","ID"))=""
    KILL %ydboctozduplicate(3)
    QUIT
