SQL State: 02000
No results were returned by the query.1
2
3
4
1000
1000
1000
1000
description1
null
description3
description4

# Confirm piecevalue2colvalue call included in generated plan:

;; This is a generated file; do not modify. Generated M code corresponds to below SQL query
;; ---------------------------------------------------------
;  select description from index_description
;; ---------------------------------------------------------

octoPlan0(cursorId,wrapInTp)
    NEW %ydboctog,%ydboctop,%ydboctoexpr
    TSTART:wrapInTp ():(serial)
    DO octoPlan1(cursorId)
    TCOMMIT:wrapInTp
    QUIT

octoPlan1(cursorId)
    NEW %ydboctoz,%ydboctoexpr KILL %ydboctocursor(cursorId,"keys",3,"","")
    SET %ydboctocursor(cursorId,"keys",1,"INDEX_DESCRIPTION","INDEX_ID")=0
    FOR  SET %ydboctocursor(cursorId,"keys",1,"INDEX_DESCRIPTION","INDEX_ID")=$ORDER(^DD("IX",%ydboctocursor(cursorId,"keys",1,"INDEX_DESCRIPTION","INDEX_ID"))) QUIT:('(%ydboctocursor(cursorId,"keys",1,"INDEX_DESCRIPTION","INDEX_ID"))!(%ydboctocursor(cursorId,"keys",1,"INDEX_DESCRIPTION","INDEX_ID")=""))  DO
    . SET %ydboctocursor(cursorId,"keys",1,"INDEX_DESCRIPTION","INDEX_DESCRIPTION_ID")=0
    . FOR  SET %ydboctocursor(cursorId,"keys",1,"INDEX_DESCRIPTION","INDEX_DESCRIPTION_ID")=$ORDER(^DD("IX",%ydboctocursor(cursorId,"keys",1,"INDEX_DESCRIPTION","INDEX_ID"),.1,%ydboctocursor(cursorId,"keys",1,"INDEX_DESCRIPTION","INDEX_DESCRIPTION_ID"))) QUIT:('(%ydboctocursor(cursorId,"keys",1,"INDEX_DESCRIPTION","INDEX_DESCRIPTION_ID"))!(%ydboctocursor(cursorId,"keys",1,"INDEX_DESCRIPTION","INDEX_DESCRIPTION_ID")=""))  DO
    . . SET %ydboctoexpr=1
    . . DO:%ydboctoexpr
    . . . SET:1&$INCREMENT(%ydboctocursor(cursorId,"keys",3,"","")) %ydboctoz=42
    . . . SET %ydboctoexpr=$E($G(^DD("IX",%ydboctocursor(cursorId,"keys",1,"INDEX_DESCRIPTION","INDEX_ID"),.1,%ydboctocursor(cursorId,"keys",1,"INDEX_DESCRIPTION","INDEX_DESCRIPTION_ID"),0)),1,245) SET:(""=%ydboctoexpr) %ydboctoexpr=$ZYSQLNULL
    . . . SET %ydboctoexpr=$$str2mval^%ydboctoplanhelpers(%ydboctoexpr)
    . . . SET %ydboctocursor(cursorId,"keys",3,"","",%ydboctocursor(cursorId,"keys",3,"",""))=%ydboctoexpr
    QUIT
;; This is a generated file; do not modify. Generated M code corresponds to below SQL query
;; ---------------------------------------------------------
;  select index_id from index_description
;; ---------------------------------------------------------

octoPlan0(cursorId,wrapInTp)
    NEW %ydboctog,%ydboctop,%ydboctoexpr
    TSTART:wrapInTp ():(serial)
    DO octoPlan1(cursorId)
    TCOMMIT:wrapInTp
    QUIT

octoPlan1(cursorId)
    NEW %ydboctoz,%ydboctoexpr KILL %ydboctocursor(cursorId,"keys",3,"","")
    SET %ydboctocursor(cursorId,"keys",1,"INDEX_DESCRIPTION","INDEX_ID")=0
    FOR  SET %ydboctocursor(cursorId,"keys",1,"INDEX_DESCRIPTION","INDEX_ID")=$ORDER(^DD("IX",%ydboctocursor(cursorId,"keys",1,"INDEX_DESCRIPTION","INDEX_ID"))) QUIT:('(%ydboctocursor(cursorId,"keys",1,"INDEX_DESCRIPTION","INDEX_ID"))!(%ydboctocursor(cursorId,"keys",1,"INDEX_DESCRIPTION","INDEX_ID")=""))  DO
    . SET %ydboctocursor(cursorId,"keys",1,"INDEX_DESCRIPTION","INDEX_DESCRIPTION_ID")=0
    . FOR  SET %ydboctocursor(cursorId,"keys",1,"INDEX_DESCRIPTION","INDEX_DESCRIPTION_ID")=$ORDER(^DD("IX",%ydboctocursor(cursorId,"keys",1,"INDEX_DESCRIPTION","INDEX_ID"),.1,%ydboctocursor(cursorId,"keys",1,"INDEX_DESCRIPTION","INDEX_DESCRIPTION_ID"))) QUIT:('(%ydboctocursor(cursorId,"keys",1,"INDEX_DESCRIPTION","INDEX_DESCRIPTION_ID"))!(%ydboctocursor(cursorId,"keys",1,"INDEX_DESCRIPTION","INDEX_DESCRIPTION_ID")=""))  DO
    . . SET %ydboctoexpr=1
    . . DO:%ydboctoexpr
    . . . SET:1&$INCREMENT(%ydboctocursor(cursorId,"keys",3,"","")) %ydboctoz=42
    . . . SET %ydboctoexpr=%ydboctocursor(cursorId,"keys",1,"INDEX_DESCRIPTION","INDEX_ID")
    . . . SET %ydboctoexpr=$$str2mval^%ydboctoplanhelpers(%ydboctoexpr)
    . . . SET %ydboctocursor(cursorId,"keys",3,"","",%ydboctocursor(cursorId,"keys",3,"",""))=%ydboctoexpr
    QUIT
;; This is a generated file; do not modify. Generated M code corresponds to below SQL query
;; ---------------------------------------------------------
;  select index_description_id from index_description
;; ---------------------------------------------------------

octoPlan0(cursorId,wrapInTp)
    NEW %ydboctog,%ydboctop,%ydboctoexpr
    TSTART:wrapInTp ():(serial)
    DO octoPlan1(cursorId)
    TCOMMIT:wrapInTp
    QUIT

octoPlan1(cursorId)
    NEW %ydboctoz,%ydboctoexpr KILL %ydboctocursor(cursorId,"keys",3,"","")
    SET %ydboctocursor(cursorId,"keys",1,"INDEX_DESCRIPTION","INDEX_ID")=0
    FOR  SET %ydboctocursor(cursorId,"keys",1,"INDEX_DESCRIPTION","INDEX_ID")=$ORDER(^DD("IX",%ydboctocursor(cursorId,"keys",1,"INDEX_DESCRIPTION","INDEX_ID"))) QUIT:('(%ydboctocursor(cursorId,"keys",1,"INDEX_DESCRIPTION","INDEX_ID"))!(%ydboctocursor(cursorId,"keys",1,"INDEX_DESCRIPTION","INDEX_ID")=""))  DO
    . SET %ydboctocursor(cursorId,"keys",1,"INDEX_DESCRIPTION","INDEX_DESCRIPTION_ID")=0
    . FOR  SET %ydboctocursor(cursorId,"keys",1,"INDEX_DESCRIPTION","INDEX_DESCRIPTION_ID")=$ORDER(^DD("IX",%ydboctocursor(cursorId,"keys",1,"INDEX_DESCRIPTION","INDEX_ID"),.1,%ydboctocursor(cursorId,"keys",1,"INDEX_DESCRIPTION","INDEX_DESCRIPTION_ID"))) QUIT:('(%ydboctocursor(cursorId,"keys",1,"INDEX_DESCRIPTION","INDEX_DESCRIPTION_ID"))!(%ydboctocursor(cursorId,"keys",1,"INDEX_DESCRIPTION","INDEX_DESCRIPTION_ID")=""))  DO
    . . SET %ydboctoexpr=1
    . . DO:%ydboctoexpr
    . . . SET:1&$INCREMENT(%ydboctocursor(cursorId,"keys",3,"","")) %ydboctoz=42
    . . . SET %ydboctoexpr=%ydboctocursor(cursorId,"keys",1,"INDEX_DESCRIPTION","INDEX_DESCRIPTION_ID")
    . . . SET %ydboctoexpr=$$str2mval^%ydboctoplanhelpers(%ydboctoexpr)
    . . . SET %ydboctocursor(cursorId,"keys",3,"","",%ydboctocursor(cursorId,"keys",3,"",""))=%ydboctoexpr
    QUIT
