
-- TVD0003 : Test Realistic Sample Query 1

SELECT P.NAME AS PATIENT_NAME, P.PATIENT_ID as PATIENT_ID,
       P.WARD_LOCATION,
       TOKEN(REPLACE(TOKEN(REPLACE(P.WARD_LOCATION,"WARD ",""),"-",1),"WARD ","")," ",2) AS PCU,
       CONCAT(TOKEN(REPLACE(TOKEN(REPLACE(P.WARD_LOCATION,"WARD ",""),"-",2),"WARD ","")," ",1)," ",TOKEN(P.WARD_LOCATION,"-",3)) AS UNIT,
       P.ROOM_BED as ROOM_BED,
       REPLACE(P.DIVISION,"VEHU","") as FACILTY,
       P.SEX as SEX,
       P.CURRENT_ADMISSION as CURRENT_ADMISSION,
       P.CURRENT_MOVEMENT as CURRENT_MOVEMENT,
       DATEFORMAT(P.DATE_OF_BIRTH,"5Z") as DATE_OF_BIRTH,
       -- P.Age, -- Don't add Age to pipeline as it will keep changing
       PM.PATIENT_MOVEMENT_ID as Current_Patient_Movement,
       PM.TYPE_OF_MOVEMENT as Current_Movement_Type,
       AM.PATIENT_MOVEMENT_ID as Admission_Movement,
       AM.TYPE_OF_MOVEMENT as Admission_Type
FROM PATIENT P
left join patient_movement PM on P.CURRENT_MOVEMENT=PM.PATIENT_MOVEMENT_ID
left join patient_movement AM on P.CURRENT_ADMISSION=AM.PATIENT_MOVEMENT_ID
where P.CURRENT_MOVEMENT is not null
and P.ward_location not like "ZZ%" and P.NAME not like "ZZ%";

PATIENT_NAME|PATIENT_ID|WARD_LOCATION|PCU|UNIT|ROOM_BED|FACILTY|SEX|CURRENT_ADMISSION|CURRENT_MOVEMENT|DATE_OF_BIRTH|CURRENT_PATIENT_MOVEMENT|CURRENT_MOVEMENT_TYPE|ADMISSION_MOVEMENT|ADMISSION_TYPE
EIGHT,PATIENT|3|7A GEN MED|GEN| |722-B|VEHU CBOC|M|4612|4612|04/07/1935|4612|1|4612|1
ONEHUNDRED,PATIENT|100013|ICU/CCU|| |ICU-10|VEHU DIVISION|M|4686|4686|04/07/1935|4686|1|4686|1
BCMA,ONE-PATIENT|100015|BCMA|| |1-A|VEHU CBOC|M|3405|3405|04/07/1935|3405|1|3405|1
BCMA,TWO-PATIENT|100016|BCMA|| |1-B|VEHU CBOC|M|3407|3407|04/07/1935|3407|1|3407|1
BCMA,THREE-PATIENT|100017|BCMA|| |1-C|VEHU CBOC|M|3409|3409|04/07/1935|3409|1|3409|1
BCMA,FOUR-PATIENT|100018|BCMA|| |1-D|VEHU CBOC|M|3411|3411|04/07/1935|3411|1|3411|1
BCMA,FIVE-PATIENT|100019|BCMA|| |1-E|VEHU CBOC|M|3413|3413|04/07/1935|3413|1|3413|1
BCMA,SIX-PATIENT|100020|BCMA|| |2-A|VEHU CBOC|M|3415|3415|04/07/1935|3415|1|3415|1
BCMA,SEVEN-PATIENT|100021|BCMA|| |2-B|VEHU CBOC|M|3417|3417|04/07/1935|3417|1|3417|1
BCMA,EIGHT|100022|ICU/CCU|| |ICU-7|VEHU DIVISION|M|4604|4604|04/07/1945|4604|3|4604|3
BCMA,NINE-PATIENT|100023|BCMA|| |2-D|VEHU CBOC|M|3421|3421|04/07/1935|3421|1|3421|1
BCMA,TEN-PATIENT|100024|BCMA|| |2-E|VEHU CBOC|M|3423|3423|04/07/1935|3423|1|3423|1
BCMA,ELEVEN-PATIENT MIDDEN JR|100025|BCMA|| |3-A|VEHU CBOC|M|3425|3425|04/07/1935|3425|1|3425|1
BCMA,TWELVE-PATIENT|100026|BCMA|| |3-B|VEHU CBOC|M|3427|3427|04/07/1935|3427|1|3427|1
BCMA,THIRTEEN-PATIENT|100027|BCMA|| |3-C|VEHU CBOC|M|3429|3429|04/07/1935|3429|1|3429|1
BCMA,FOURTEEN-PATIENT|100028|BCMA|| |3-D|VEHU CBOC|M|3431|3431|04/07/1935|3431|1|3431|1
BCMA,FIFTEEN-PATIENT|100030|BCMA|| |3-E|VEHU CBOC|M|3433|3433|04/07/1935|3433|1|3433|1
BCMA,SIXTEEN-PATIENT|100031|BCMA|| |4-A|VEHU CBOC|M|3435|3435|04/07/1935|3435|1|3435|1
BCMA,SEVENTEEN-PATIENT|100032|BCMA|| |14-D|VEHU CBOC|M|3982|3982|04/07/1935|3982|1|3982|1
BCMA,EIGHTEEN-PATIENT|100033|BCMA|| |4-B|VEHU CBOC|M|3437|3437|04/07/1935|3437|1|3437|1
BCMA,NINETEEN-PATIENT|100034|BCMA|| |4-C|VEHU CBOC|M|3439|3439|04/07/1935|3439|1|3439|1
BCMA,TWENTY-PATIENT|100035|BCMA|| |4-D|VEHU CBOC|M|3441|3441|04/07/1935|3441|1|3441|1
BCMA,TWENTYTWO-PATIENT|100036|BCMA|| |4-E|VEHU CBOC|M|3443|3443|04/07/1935|3443|1|3443|1
BCMA,TWENTYONE-PATIENT|100037|BCMA|| |5-A|VEHU CBOC|M|3445|3445|04/07/1935|3445|1|3445|1
BCMA,TWENTYTHREE-PATIENT|100038|BCMA|| |5-B|VEHU CBOC|M|3447|3447|04/07/1935|3447|1|3447|1
BCMA,TWENTYFOUR-PATIENT|100039|BCMA|| |5-C|VEHU CBOC|M|3449|3449|04/07/1935|3449|1|3449|1
BCMA,TWENTYFIVE-PATIENT|100040|BCMA|| |5-D|VEHU CBOC|M|3451|3451|04/07/1935|3451|1|3451|1
BCMA,TWENTYSIX-PATIENT|100041|BCMA|| |5-E|VEHU CBOC|M|3453|3453|04/07/1935|3453|1|3453|1
BCMA,TWENTYSEVEN-PATIENT|100042|BCMA|| |6-A|VEHU CBOC|M|3455|3455|04/07/1935|3455|1|3455|1
BCMA,TWENTYEIGHT-PATIENT|100043|BCMA|| |6-B|VEHU CBOC|M|3457|3457|04/07/1935|3457|1|3457|1
BCMA,TWENTYNINE-PATIENT|100044|BCMA|| |14-E|VEHU CBOC|M|3984|3984|04/07/1935|3984|1|3984|1
BCMA,THIRTY-PATIENT|100045|BCMA|| |6-C|VEHU CBOC|M|3459|3459|04/07/1935|3459|1|3459|1
BCMA,THIRTYONE-PATIENT|100046|BCMA|| |6-D|VEHU CBOC|M|3461|3461|04/07/1935|3461|1|3461|1
BCMA,THIRTYTWO-PATIENT|100047|BCMA|| |6-E|VEHU CBOC|M|3463|3463|04/07/1935|3463|1|3463|1
BCMA,THIRTYTHREE-PATIENT|100048|BCMA|| |6-F|VEHU CBOC|M|3465|3465|04/07/1935|3465|1|3465|1
BCMA,THIRTYFOUR-PATIENT|100049|BCMA|| |6-G|VEHU CBOC|M|3467|3467|04/07/1935|3467|1|3467|1
BCMA,THIRTYFIVE-PATIENT|100050|BCMA|| |7-A|VEHU CBOC|M|3469|3469|04/07/1935|3469|1|3469|1
BCMA,THIRTYSIX-PATIENT|100051|BCMA|| |7-B|VEHU CBOC|M|3471|3471|04/07/1935|3471|1|3471|1
BCMA,THIRTYSEVEN-PATIENT|100052|BCMA|| |7-C|VEHU CBOC|M|3473|3473|04/07/1935|3473|1|3473|1
BCMA,THIRTYEIGHT-PATIENT|100053|BCMA|| |7-D|VEHU CBOC|M|3475|3475|04/07/1935|3475|1|3475|1
BCMA,THIRTYNINE-PATIENT|100054|BCMA|| |7-E|VEHU CBOC|M|3477|3477|04/07/1935|3477|1|3477|1
BCMA,FORTY-PATIENT|100055|BCMA|| |7-F|VEHU CBOC|M|3479|3479|04/07/1935|3479|1|3479|1
BCMA,FORTYONE-PATIENT|100056|BCMA|| |7-G|VEHU CBOC|M|3481|3481|04/07/1935|3481|1|3481|1
BCMA,FORTYTWO-PATIENT|100057|BCMA|| |8-A|VEHU CBOC|M|3483|3483|04/07/1935|3483|1|3483|1
BCMA,FORTYTHREE-PATIENT|100058|BCMA|| |8-B|VEHU CBOC|M|3485|3485|04/07/1935|3485|1|3485|1
BCMA,FORTYFOUR-PATIENT|100059|BCMA|| |8-C|VEHU CBOC|M|3487|3487|04/07/1935|3487|1|3487|1
BCMA,FORTYFIVE-PATIENT|100060|BCMA|| |8-D|VEHU CBOC|M|3489|3489|04/07/1935|3489|1|3489|1
BCMA,FORTYSIX-PATIENT|100061|BCMA|| |8-E|VEHU CBOC|M|3491|3491|04/07/1935|3491|1|3491|1
BCMA,FORTYSEVEN-PATIENT|100062|BCMA|| |8-F|VEHU CBOC|M|3493|3493|04/07/1935|3493|1|3493|1
BCMA,FORTYEIGHT-PATIENT|100063|BCMA|| |8-G|VEHU CBOC|M|3495|3495|04/07/1935|3495|1|3495|1
BCMA,FORTYNINE-PATIENT|100064|BCMA|| |8-H|VEHU CBOC|M|3497|3497|04/07/1935|3497|1|3497|1
REGRESSION,TEST PATIENT ONE|100065|BCMA|| |8-I|VEHU CBOC|M|3499|3499|04/07/1935|3499|1|3499|1
BCMA,FIFTYONE-PATIENT|100066|BCMA|| |8-J|VEHU CBOC|M|3501|3501|04/07/1935|3501|1|3501|1
BCMA,FIFTYTWO-PATIENT|100067|BCMA|| |9-A|VEHU CBOC|M|3503|3503|04/07/1935|3503|1|3503|1
BCMA,FIFTYTHREE-PATIENT|100068|BCMA|| |9-B|VEHU CBOC|M|3505|3505|04/07/1935|3505|1|3505|1
BCMA,FIFTYFOUR-PATIENT|100069|BCMA|| |9-C|VEHU CBOC|M|3507|3507|04/07/1935|3507|1|3507|1
BCMA,FIFTYFIVE-PATIENT|100070|BCMA|| |9-D|VEHU CBOC|M|3509|3509|04/07/1935|3509|1|3509|1
BCMA,FIFTYSIX-PATIENT|100071|BCMA|| |9-E|VEHU CBOC|M|3511|3511|04/07/1935|3511|1|3511|1
BCMA,FIFTYSEVEN-PATIENT|100072|BCMA|| |9-F|VEHU CBOC|M|3513|3513|04/07/1935|3513|1|3513|1
BCMA,FIFTYEIGHT-PATIENT|100073|BCMA|| |9-G|VEHU CBOC|M|3515|3515|04/07/1935|3515|1|3515|1
BCMA,FIFTYNINE-PATIENT|100074|BCMA|| |9-H|VEHU CBOC|M|3517|3517|04/07/1935|3517|1|3517|1
BCMA,SIXTY-PATIENT|100075|BCMA|| |10-A|VEHU CBOC|M|3519|3519|04/07/1935|3519|1|3519|1
BCMA,SIXTYONE-PATIENT|100076|BCMA|| |10-B|VEHU CBOC|M|3521|3521|04/07/1935|3521|1|3521|1
BCMA,SIXTYTWO-PATIENT|100077|BCMA|| |10-C|VEHU CBOC|M|3523|3523|04/07/1935|3523|1|3523|1
BCMA,SIXTYTHREE-PATIENT|100078|BCMA|| |10-D|VEHU CBOC|M|3525|3525|04/07/1935|3525|1|3525|1
BCMA,SIXTYFOUR-PATIENT|100079|BCMA|| |10-E|VEHU CBOC|M|3527|3527|04/07/1935|3527|1|3527|1
BCMA,SIXTYFIVE-PATIENT|100080|BCMA|| |10-F|VEHU CBOC|M|3529|3529|04/07/1935|3529|1|3529|1
BCMA,SIXTYSIX-PATIENT|100081|BCMA|| |10-G|VEHU CBOC|M|3531|3531|04/07/1935|3531|1|3531|1
BCMA,SIXTYSEVEN-PATIENT|100082|BCMA|| |10-H|VEHU CBOC|M|3533|3533|04/07/1935|3533|1|3533|1
BCMA,SIXTYEIGHT-PATIENT|100083|BCMA|| |10-I|VEHU CBOC|M|3535|3535|04/07/1935|3535|1|3535|1
BCMA,SIXTYNINE-PATIENT|100084|BCMA|| |10-J|VEHU CBOC|M|3537|3537|04/07/1935|3537|1|3537|1
BCMA,SEVENTY-PATIENT|100085|BCMA|| |11-A|VEHU CBOC|M|3539|3539|04/07/1935|3539|1|3539|1
BCMA,SEVENTYONE-PATIENT|100086|BCMA|| |11-B|VEHU CBOC|M|3541|3541|04/07/1935|3541|1|3541|1
BCMA,SEVENTYTWO-PATIENT|100087|BCMA|| |11-C|VEHU CBOC|M|3543|3543|04/07/1935|3543|1|3543|1
BCMA,SEVENTYTHREE-PATIENT|100088|BCMA|| |11-D|VEHU CBOC|M|3545|3545|04/07/1935|3545|1|3545|1
BCMA,SEVENTYFOUR-PATIENT|100089|BCMA|| |11-E|VEHU CBOC|M|3547|3547|04/07/1935|3547|1|3547|1
BCMA,SEVENTYFIVE-PATIENT|100090|BCMA|| |11-F|VEHU CBOC|M|3549|3549|04/07/1935|3549|1|3549|1
BCMA,SEVENTYSIX-PATIENT|100091|BCMA|| |11-G|VEHU CBOC|M|3551|3551|04/07/1935|3551|1|3551|1
BCMA,SEVENTYSEVEN-PATIENT|100092|BCMA|| |11-H|VEHU CBOC|M|3553|3553|04/07/1935|3553|1|3553|1
BCMA,SEVENTYEIGHT-PATIENT|100093|BCMA|| |11-I|VEHU CBOC|M|3555|3555|04/07/1935|3555|1|3555|1
BCMA,SEVENTYNINE-PATIENT|100094|BCMA|| |12-A|VEHU CBOC|M|3557|3557|04/07/1935|3557|1|3557|1
BCMA,EIGHTY-PATIENT|100095|BCMA|| |12-B|VEHU CBOC|M|3559|3559|04/07/1935|3559|1|3559|1
BCMA,EIGHTYONE-PATIENT|100096|BCMA|| |12-C|VEHU CBOC|M|3561|3561|04/07/1935|3561|1|3561|1
BCMA,EIGHTYTWO-PATIENT|100097|BCMA|| |12-D|VEHU CBOC|M|3563|3563|04/07/1935|3563|1|3563|1
BCMA,EIGHTYTHREE-PATIENT|100098|BCMA|| |12-E|VEHU CBOC|M|3565|3565|04/07/1935|3565|1|3565|1
BCMA,EIGHTYFOUR-PATIENT|100099|BCMA|| |12-F|VEHU CBOC|M|3567|3567|04/07/1935|3567|1|3567|1
BCMA,EIGHTYFIVE-PATIENT|100100|BCMA|| |12-G|VEHU CBOC|M|3569|3569|04/07/1935|3569|1|3569|1
BCMA,EIGHTYSIX-PATIENT|100101|BCMA|| |12-H|VEHU CBOC|M|3571|3571|04/07/1935|3571|1|3571|1
BCMA,EIGHTYSEVEN-PATIENT|100102|BCMA|| |12-I|VEHU CBOC|M|3573|3573|04/07/1935|3573|1|3573|1
BCMA,EIGHTYNINE-PATIENT|100103|BCMA|| |13-A|VEHU CBOC|M|3575|3575|04/07/1935|3575|1|3575|1
BCMA,EIGHTYEIGHT-PATIENT|100104|BCMA|| |13-B|VEHU CBOC|M|3577|3577|04/07/1935|3577|1|3577|1
BCMA,NINETY-PATIENT|100105|BCMA|| |13-C|VEHU CBOC|M|3579|3579|04/07/1935|3579|1|3579|1
BCMA,NINETYONE-PATIENT|100106|BCMA|| |13-D|VEHU CBOC|M|3581|3581|04/07/1935|3581|1|3581|1
BCMA,NINETYTWO-PATIENT|100107|BCMA|| |13-E|VEHU CBOC|M|3583|3583|04/07/1935|3583|1|3583|1
BCMA,NINETYTHREE-PATIENT|100108|BCMA|| |13-F|VEHU CBOC|M|3585|3585|04/07/1935|3585|1|3585|1
BCMA,NINETYFOUR-PATIENT|100109|BCMA|| |13-G|VEHU CBOC|M|3587|3587|04/07/1935|3587|1|3587|1
BCMA,NINETYFIVE-PATIENT|100110|BCMA|| |13-H|VEHU CBOC|M|3589|3589|04/07/1935|3589|1|3589|1
BCMA,NINETYSIX-PATIENT|100111|BCMA|| |13-I|VEHU CBOC|M|3591|3591|04/07/1935|3591|1|3591|1
BCMA,NINETYSEVEN-PATIENT|100112|BCMA|| |13-J|VEHU CBOC|M|3593|3593|04/07/1935|3593|1|3593|1
BCMA,NINETYEIGHT-PATIENT|100113|BCMA|| |14-A|VEHU CBOC|M|3595|3595|04/07/1935|3595|1|3595|1
BCMA,NINETYNINE-PATIENT|100114|BCMA|| |14-B|VEHU CBOC|M|3597|3597|04/07/1935|3597|1|3597|1
BCMA,ONE HUNDRED-PATIENT|100115|BCMA|| |14-C|VEHU CBOC|M|3599|3599|04/07/1935|3599|1|3599|1
TWOHUNDREDSIXTEEN,PATIENT|100162|7A GEN MED|GEN| ||VEHU CBOC|M|4764|4764|04/07/1935|4764|1|4764|1
TWOHUNDREDFORTYNINE,PATIENT|100195|7B|| |||M|3707|3707|04/07/1935|3707|1|3707|1
ONEHUNDREDNINETYSIX,PATIENT|100296|7A GEN MED|GEN| ||VEHU CBOC|M|4711|4711|04/07/1935|4711|1|4711|1
ONE,INAPTIENT ONE|100708|7A GEN MED|GEN| |722-A|VEHU CBOC|M|4362|4362|03/09/1945|4362|1|4362|1
ZERO,INPATIENT|100709|7A SURG|SURG| |775-A|VEHU CBOC|M|4672|4672|03/09/1945|4672|1|4672|1
TWO,INPATIENT|100710|7A GEN MED|GEN| |722-C|VEHU CBOC|M|4607|4607|03/09/1945|4607|1|4607|1
THREE,INPATIENT|100711|7A GEN MED|GEN| |724-A|VEHU CBOC|M|4366|4366|03/09/1945|4366|1|4366|1
FOUR,INPATIENT|100712|7A GEN MED|GEN| |724-B|VEHU CBOC|M|4368|4368|03/09/1945|4368|1|4368|1
FIVE,INPATIENT|100713|7A GEN MED|GEN| |724-C|VEHU CBOC|M|4370|4370|03/09/1945|4370|1|4370|1
SIX,INPATIENT|100714|7A GEN MED|GEN| |724-D|VEHU CBOC|M|4372|4372|03/09/1945|4372|1|4372|1
SEVEN,INPATIENT|100715|7A GEN MED|GEN| |726-A|VEHU CBOC|M|4374|4374|03/09/1945|4374|1|4374|1
EIGHT,INPATIENT|100716|3E NORTH|NORTH| |3E-100-1|VEHU CBOC|M|4636|4636|03/09/1945|4636|1|4636|1
NINE,INPATIENT|100717|7A GEN MED|GEN| |726-C|VEHU CBOC|M|4378|4378|03/09/1945|4378|1|4378|1
TEN,INPATIENT|100718|7A GEN MED|GEN| |726-D|VEHU CBOC|M|4380|4380|03/09/1945|4380|1|4380|1
ELEVEN,INPATIENT|100719|7A GEN MED|GEN| |727-A|VEHU CBOC|M|4382|4382|03/09/1945|4382|1|4382|1
TWELVE,INPATIENT|100720|7A GEN MED|GEN| |727-B|VEHU CBOC|M|4384|4384|03/09/1945|4384|1|4384|1
THIRTEEN,INPATIENT|100721|7A GEN MED|GEN| |728-A|VEHU CBOC|M|4386|4386|03/09/1945|4386|1|4386|1
FOURTEEN,INPATIENT|100722|7A GEN MED|GEN| |728-B|VEHU CBOC|M|4388|4388|03/09/1945|4388|1|4388|1
FIFTEEN,INPATIENT|100723|7A GEN MED|GEN| |729-A|VEHU CBOC|M|4390|4390|03/09/1945|4390|1|4390|1
SIXTEEN,INPATIENT|100724|7A GEN MED|GEN| |729-B|VEHU CBOC|M|4392|4392|03/09/1945|4392|1|4392|1
SEVENTEEN,INPATIENT|100725|7A GEN MED|GEN| |730-A|VEHU CBOC|M|4394|4394|03/09/1945|4394|1|4394|1
EIGHTEEN,INPATIENT|100726|7A GEN MED|GEN| |730-B|VEHU CBOC|M|4396|4396|03/09/1945|4396|1|4396|1
NINETEEN,INPATIENT|100727|7A GEN MED|GEN| |731-A|VEHU CBOC|F|4398|4398|06/01/1995|4398|1|4398|1
TWENTY,INPATIENT|100728|7A GEN MED|GEN| |731-B|VEHU CBOC|M|4400|4400|03/09/1945|4400|1|4400|1
TWENTYONE,INPATIENT|100729|7A GEN MED|GEN| |732-B|VEHU CBOC|M|4402|4402|03/09/1945|4402|1|4402|1
TWENTYTWO,INPATIENT|100730|7A GEN MED|GEN| |733-A|VEHU CBOC|M|4404|4404|03/09/1945|4404|1|4404|1
TWENTYTHREE,INPATIENT|100731|7A GEN MED|GEN| |733-B|VEHU CBOC|M|4406|4406|03/09/1945|4406|1|4406|1
TWENTYFOUR,INPATIENT|100732|7A GEN MED|GEN| |734-A|VEHU CBOC|M|4408|4408|03/09/1945|4408|1|4408|1
TWENTYFIVE,INPATIENT|100733|7A GEN MED|GEN| |734-B|VEHU CBOC|M|4410|4410|03/09/1945|4410|1|4410|1
TWENTYSIX,INPATIENT|100734|7A SURG|SURG| |760-A|VEHU CBOC|M|4412|4412|03/09/1945|4412|1|4412|1
TWENTYSEVEN,INPATIENT|100735|7A SURG|SURG| |760-B|VEHU CBOC|M|4414|4414|03/09/1945|4414|1|4414|1
TWENTYEIGHT,INPATIENT|100736|7A SURG|SURG| |761-A|VEHU CBOC|M|4416|4416|03/09/1945|4416|1|4416|1
TWENTYNINE,INPATIENT|100737|7A SURG|SURG| |761-B|VEHU CBOC|M|4418|4418|03/09/1945|4418|1|4418|1
THIRTY,INPATIENT|100738|7A SURG|SURG| |762-A|VEHU CBOC|M|4420|4420|03/09/1945|4420|1|4420|1
THIRTYONE,INPATIENT|100739|7A SURG|SURG| |762-B|VEHU CBOC|M|4422|4422|03/09/1945|4422|1|4422|1
THIRTYTWO,INPATIENT|100740|7A SURG|SURG| |763-A|VEHU CBOC|M|4424|4424|03/09/1945|4424|1|4424|1
THIRTYTHREE,INPATIENT|100741|7A SURG|SURG| |763-B|VEHU CBOC|M|4426|4426|03/09/1945|4426|1|4426|1
THIRTYFOUR,INPATIENT|100742|7A SURG|SURG| |764-A|VEHU CBOC|M|4428|4428|03/09/1945|4428|1|4428|1
THIRTYFIVE,INPATIENT|100743|7A SURG|SURG| |764-B|VEHU CBOC|M|4432|4432|03/09/1945|4432|1|4432|1
THIRTYSIX,INPATIENT|100744|7A SURG|SURG| |765-A|VEHU CBOC|M|4434|4434|03/09/1945|4434|1|4434|1
THIRTYSEVEN,INPATIENT|100745|7A SURG|SURG| |765-B|VEHU CBOC|M|4436|4436|03/09/1945|4436|1|4436|1
THIRTYEIGHT,INPATIENT|100746|7A SURG|SURG| |766-A|VEHU CBOC|M|4438|4438|03/09/1945|4438|1|4438|1
THIRTYNINE,INPATIENT|100747|7A SURG|SURG| |766-B|VEHU CBOC|M|4440|4440|03/09/1945|4440|1|4440|1
FORTY,INPATIENT|100748|7A SURG|SURG| |767-A|VEHU CBOC|F|4442|4442|03/09/1989|4442|1|4442|1
FORTYONE,INPATIENT|100749|7A SURG|SURG| |767-B|VEHU CBOC|M|4444|4444|03/09/1945|4444|1|4444|1
FORTYTWO,INPATIENT|100750|7A SURG|SURG| |768-A|VEHU CBOC|M|4446|4446|03/09/1945|4446|1|4446|1
FORTYTHREE,INPATIENT|100751|7A SURG|SURG| |768-B|VEHU CBOC|M|4448|4448|03/09/1945|4448|1|4448|1
FORTYFOUR,INPATIENT|100752|7A SURG|SURG| |769-A|VEHU CBOC|F|4450|4450|03/09/1945|4450|1|4450|1
FORTYFIVE,INPATIENT|100753|7A SURG|SURG| |769-B|VEHU CBOC|F|4452|4452|12/25/1994|4452|1|4452|1
FORTYSIX,INPATIENT|100754|7A SURG|SURG| |770-A|VEHU CBOC|F|4454|4454|08/09/1993|4454|1|4454|1
FORTYSEVEN,INPATIENT|100755|7A SURG|SURG| |770-B|VEHU CBOC|F|4456|4456|03/09/1945|4456|1|4456|1
FORTYEIGHT,INPATIENT|100756|7A SURG|SURG| |771-A|VEHU CBOC|F|4458|4458|04/11/1992|4458|1|4458|1
FORTYNINE,INPATIENT|100757|7A SURG|SURG| |771-B|VEHU CBOC|M|4460|4460|03/09/1945|4460|1|4460|1
FIFTY,INPATIENT|100758|7A SURG|SURG| |772-A|VEHU CBOC|M|4462|4462|03/09/1945|4462|1|4462|1
FIFTYONE,INPATIENT|100759|NHCU|| |NH1-A||M|4464|4464|03/09/1945|4464|1|4464|1
FIFTYTWO,INPATIENT|100760|NHCU|| |NH1-B||M|4466|4466|03/09/1945|4466|1|4466|1
FIFTYTHREE,INPATIENT|100761|NHCU|| |NH2-A||M|4468|4468|03/09/1945|4468|1|4468|1
FIFTYFOUR,INPATIENT|100762|NHCU|| |NH2-B||M|4470|4470|03/09/1945|4470|1|4470|1
FIFTYFIVE,INPATIENT|100763|NHCU|| |NH3-A||M|4472|4472|03/09/1945|4472|1|4472|1
FIFTYSIX,INPATIENT|100764|NHCU|| |NH3-B||M|4474|4474|03/09/1945|4474|1|4474|1
FIFTYSEVEN,INPATIENT|100765|NHCU|| |NH4-A||M|4476|4476|03/09/1945|4476|1|4476|1
FIFTYEIGHT,INPATIENT|100766|NHCU|| |NH4-B||M|4478|4478|03/09/1945|4478|1|4478|1
FIFTYNINE,INPATIENT|100767|NHCU|| |NH5-A||M|4480|4480|03/09/1945|4480|1|4480|1
SIXTY,INPATIENT|100768|NHCU|| |NH5-B||M|4482|4482|03/09/1945|4482|1|4482|1
SIXTYONE,INPATIENT|100769|NHCU|| |NH6-A||M|4484|4484|03/09/1945|4484|1|4484|1
SIXTYTWO,INPATIENT|100770|NHCU|| |NH6-B||M|4486|4486|03/09/1945|4486|1|4486|1
SIXTYTHREE,INPATIENT|100771|NHCU|| |NH7-A||M|4488|4488|03/09/1945|4488|1|4488|1
SIXTYFOUR,INPATIENT|100772|NHCU|| |NH7-B||M|4490|4490|03/09/1945|4490|1|4490|1
SIXTYFIVE,INPATIENT|100773|NHCU|| |NH8-A||M|4492|4492|03/09/1945|4492|1|4492|1
SIXTYSIX,INPATIENT|100774|NHCU|| |NH8-B||M|4494|4494|03/09/1945|4494|1|4494|1
SIXTYSEVEN,INPATIENT|100775|NHCU|| |NH9-A||M|4496|4496|03/09/1945|4496|1|4496|1
SIXTYEIGHT,INPATIENT|100776|NHCU|| |NH9-B||M|4498|4498|03/09/1945|4498|1|4498|1
SIXTYNINE,INPATIENT|100777|NHCU|| |NH10-A||M|4500|4500|03/09/1945|4500|1|4500|1
SEVENTY,INPATIENT|100778|NHCU|| |NH10-B||M|4502|4502|03/09/1945|4502|1|4502|1
SEVENTYONE,INPATIENT|100779|NHCU|| |NH11-A||M|4504|4504|03/09/1945|4504|1|4504|1
SEVENTYTWO,INPATIENT|100780|NHCU|| |NH11-B||M|4506|4506|03/09/1945|4506|1|4506|1
SEVENTYTHREE,INPATIENT|100781|NHCU|| |NH12-A||M|4508|4508|03/09/1945|4508|1|4508|1
SEVENTYFOUR,INPATIENT|100782|NHCU|| |NH12-B||M|4510|4510|03/09/1945|4510|1|4510|1
SEVENTYFIVE,INPATIENT|100783|NHCU|| |NH13-A||M|4512|4512|03/09/1945|4512|1|4512|1
SEVENTYSIX,INPATIENT|100784|ICU/CCU|| |ICU-1|VEHU DIVISION|M|4514|4514|03/09/1945|4514|1|4514|1
SEVENTYSEVEN,INPATIENT|100785|ICU/CCU|| |ICU-2|VEHU DIVISION|M|4516|4516|03/09/1945|4516|1|4516|1
SEVENTYEIGHT,INPATIENT|100786|ICU/CCU|| |ICU-3|VEHU DIVISION|M|4518|4518|03/09/1945|4518|1|4518|1
SEVENTYNINE,INPATIENT|100787|ICU/CCU|| |ICU-4|VEHU DIVISION|M|4520|4520|03/09/1945|4520|1|4520|1
EIGHTY,INPATIENT|100788|ICU/CCU|| |ICU-5|VEHU DIVISION|M|4522|4522|03/09/1945|4522|1|4522|1
EIGHTYONE,INPATIENT|100789|ICU/CCU|| |ICU-6|VEHU DIVISION|M|4524|4524|03/09/1945|4524|1|4524|1
EIGHTYTWO,INPATIENT|100790|GEN MED|MED| |B-6|VEHU DIVISION|M|4652|4652|03/09/1945|4652|1|4652|1
EIGHTYTHREE,INPATIENT|100791|GEN MED|MED| |354-1|VEHU DIVISION|M|4650|4650|03/09/1945|4650|1|4650|1
EIGHTYFOUR,INPATIENT|100792|7A GEN MED|GEN| |735-A|VEHU CBOC|M|4642|4642|03/09/1945|4642|1|4642|1
EIGHTYFIVE,INPATIENT|100793|7A GEN MED|GEN| |726-B|VEHU CBOC|M|4640|4640|03/09/1945|4640|1|4640|1
EIGHTYSIX,INPATIENT|100794|GEN MED|MED| |B-5|VEHU DIVISION|M|4648|4648|03/09/1945|4648|1|4648|1
EIGHTYSEVEN,INPATIENT|100795|GEN MED|MED| |B-4|VEHU DIVISION|M|4646|4646|03/09/1945|4646|1|4646|1
EIGHTYEIGHT,INPATIENT|100796|ICU/CCU|| |1-1|VEHU DIVISION|M|4638|4638|03/09/1945|4638|1|4638|1
EIGHTYNINE,INPATIENT|100797|GEN MED|MED| |B-3|VEHU DIVISION|M|4644|4644|03/09/1945|4644|1|4644|1
NINETY,INPATIENT|100798|ICU/CCU|| |ICU-15|VEHU DIVISION|M|4542|4542|03/09/1945|4542|1|4542|1
NINETYONE,INPATIENT|100799|7A SURG|SURG| |773-A|VEHU CBOC|M|4664|4664|03/09/1945|4664|1|4664|1
NINETYTWO,INPATIENT|100800|7A SURG|SURG| |774-B|VEHU CBOC|M|4670|4670|03/09/1945|4670|1|4670|1
NINETYTHREE,INPATIENT|100801|GEN MED|MED| |A-2|VEHU DIVISION|M|4596|4596|03/09/1945|4596|3|4596|3
NINETYFOUR,INPATIENT|100802|7A GEN MED|GEN| |737-B|VEHU CBOC|M|4660|4660|03/09/1945|4660|1|4660|1
NINETYFIVE,INPATIENT|100803|7A GEN MED|GEN| |737-A|VEHU CBOC|F|4658|4658|02/14/1991|4658|1|4658|1
NINETYSIX,INPATIENT|100804|7A SURG|SURG| |774-A|VEHU CBOC|M|4668|4668|03/09/1945|4668|1|4668|1
NINETYSEVEN,INPATIENT|100805|7A SURG|SURG| |773-B|VEHU CBOC|M|4666|4666|03/09/1945|4666|1|4666|1
NINETYEIGHT,INPATIENT|100806|GEN MED|MED| |B-1|VEHU DIVISION|F|4598|4598|03/09/1945|4598|3|4598|3
NINETYNINE,INPATIENT|100807|7A SURG|SURG| |772-B|VEHU CBOC|M|4662|4662|03/09/1945|4662|1|4662|1
ONEHUNDRED,INPATIENT|100808|GEN MED|MED| |B-2|VEHU DIVISION|M|4600|4600|03/09/1945|4600|3|4600|3
ALPHATEST,NEW ONE|100841|3E NORTH|NORTH| |104-5|VEHU CBOC|M|4629|4629|01/01/1951|4629|1|4629|1
INPATIENT,GIRL|100843|7A GEN MED|GEN| |735-B|VEHU CBOC|F|4654|4654|04/01/1945|4654|1|4654|1
INPATIENT,YOUNGGIRL|100844|7A GEN MED|GEN| |736-B|VEHU CBOC|F|4656|4656|04/01/1991|4656|1|4656|1
ONE,INPATIENT TWO|100846|7A GEN MED|GEN| |722-D|VEHU CBOC|M|4614|4614|10/10/1951|4614|1|4614|1
ONE,INPATIENT THREE|100847|7A GEN MED|GEN| |736-A|VEHU CBOC|M|4616|4616|01/01/1950|4616|1|4616|1
EHMP,FIVE|100848|NHCU|| |NH15-B||M|4634|4634|03/03/1960|4634|3|4634|3
PHARMACY,INPATIENT B|100857|7B|| |||F|4674|4674|01/01/1963|4674|1|4674|1
TRASH,PAT A|100864|7A GEN MED|GEN| ||VEHU CBOC|F|4676|4676|01/01/1966|4676|1|4676|1
MEDICATIONS,REVIEW|100886|OBSERVATION|| ||VEHU CBOC|M|4678|4678|01/01/1995|4678|1|4678|1
PATIENT,TOM BRUCE|100887|ICU/CCU|| |3-1|VEHU DIVISION|M|4681|4703|04/08/1942|4703|11|4681|1
PATIENT,MICHAEL EARL|100888|ICU/CCU|| |1-2|VEHU DIVISION|M|4760|4760|06/07/1946|4760|1|4760|1
PATIENT,BROOKE ANNE|100889|7A GEN MED|GEN| ||VEHU CBOC|F|4701|4701|01/31/2000|4701|1|4701|1
PATIENT,HUGH JAMES|100890|ICU/CCU|| |ICU-8|VEHU DIVISION|M|4705|4705|08/31/2006|4705|1|4705|1
PATIENT,SIMON|100891|PSYCHIATRY|| |1-D|VEHU CBOC|M|4707|4709|01/01/1990|4709|11|4707|1
PATIENT,HEARTMALE NA|100892|DOMICILLARY|| |1-A|VEHU CBOC|M|4713|4713|09/09/1970|4713|2|4713|2
EHMP,SEVEN|100895|7A GEN MED|GEN| ||VEHU CBOC|M|5275|5275|03/03/1960|5275|1|5275|1
PATIENT,GRADEN DAPHNE|100900|NHCU|| |2-E||F|4736|4738|06/07/1950|4738|11|4736|1
PATIENT,CONCEPT RELATIONSHIP|100905|ICU/CCU|| |ICU-9|VEHU DIVISION|M|4755|4755|03/03/1960|4755|1|4755|1
PATIENT,DAN II|100907|3 NORTH SURG|NORTH| |AS-1|VEHU DIVISION|M|4762|4762|06/15/1946|4762|1|4762|1
TRAINING,PATIENT|101036|NHCU|| |NH15-B||M|4634|4778|03/03/1960|4778|3|4634|3
EHMP,EIGHT|101043|3E NORTH|NORTH| |3E-100-4|VEHU CBOC|M|5277|5277|03/03/1960|5277|1|5277|1
(227 rows)
