# Test $TLEVEL (which is driven by wrapInTp parameter passed to src/aux/_ydboctoSelect.m)
#   while in generated M code for various types of SQL queries
# Expect $TLEVEL to be 1 for INSERT INTO, DELETE FROM, UPDATE and 0 for SELECT/VALUES etc.

-- TDFT06 : OCTO54 : Test TP wrapping of M plan for DELETE FROM, INSERT INTO, UPDATE, SELECT, VALUES and UNION/INTERSECT/EXCEPT

CREATE FUNCTION DISPLAYTLEVEL() RETURNS VARCHAR AS $$DISPLAYTLEVEL^TDFT06;

SELECT '-- Test of $TLEVEL for SELECT : Expect 0';
SELECT * FROM names WHERE DISPLAYTLEVEL() is NULL LIMIT 1;

SELECT '-- Test of $TLEVEL for VALUES : Expect 0';
VALUES (1, DISPLAYTLEVEL());

SELECT '-- Test of $TLEVEL for UNION : Expect 0';
SELECT DISPLAYTLEVEL() UNION SELECT DISPLAYTLEVEL();

SELECT '-- Test of $TLEVEL for INTERSECT : Expect 0';
SELECT DISPLAYTLEVEL() INTERSECT SELECT DISPLAYTLEVEL();

SELECT '-- Test of $TLEVEL for EXCEPT : Expect 0';
SELECT DISPLAYTLEVEL() EXCEPT SELECT DISPLAYTLEVEL();

SELECT '-- Test of $TLEVEL for UNION ALL : Expect 0';
SELECT DISPLAYTLEVEL() UNION ALL SELECT DISPLAYTLEVEL();

SELECT '-- Test of $TLEVEL for INTERSECT ALL : Expect 0';
SELECT DISPLAYTLEVEL() INTERSECT ALL SELECT DISPLAYTLEVEL();

SELECT '-- Test of $TLEVEL for EXCEPT ALL : Expect 0';
SELECT DISPLAYTLEVEL() EXCEPT ALL SELECT DISPLAYTLEVEL();

SELECT '-- Test of $TLEVEL for INSERT INTO : Expect 1';
INSERT INTO names SELECT id+1,firstname,lastname FROM names WHERE DISPLAYTLEVEL() is NULL ORDER BY id DESC LIMIT 1;

SELECT '-- Test of $TLEVEL for DELETE FROM : Expect 1';
DELETE FROM names WHERE DISPLAYTLEVEL() is NULL AND id = 6;

SELECT '-- Test of $TLEVEL for UPDATE : Expect 1';
UPDATE names SET firstname = lastname, lastname = firstname WHERE DISPLAYTLEVEL() is NULL AND id = 5;

CREATE FUNCTION
???
-- Test of $TLEVEL for SELECT : Expect 0
(1 row)
$TLEVEL=0
ID|FIRSTNAME|LASTNAME
0|Zero|Cool
(1 row)
???
-- Test of $TLEVEL for VALUES : Expect 0
(1 row)
$TLEVEL=0
COLUMN1|COLUMN2
1|
(1 row)
???
-- Test of $TLEVEL for UNION : Expect 0
(1 row)
$TLEVEL=0
$TLEVEL=0
DISPLAYTLEVEL

(1 row)
???
-- Test of $TLEVEL for INTERSECT : Expect 0
(1 row)
$TLEVEL=0
$TLEVEL=0
DISPLAYTLEVEL

(1 row)
???
-- Test of $TLEVEL for EXCEPT : Expect 0
(1 row)
$TLEVEL=0
$TLEVEL=0
DISPLAYTLEVEL
(0 rows)
???
-- Test of $TLEVEL for UNION ALL : Expect 0
(1 row)
$TLEVEL=0
$TLEVEL=0
DISPLAYTLEVEL


(2 rows)
???
-- Test of $TLEVEL for INTERSECT ALL : Expect 0
(1 row)
$TLEVEL=0
$TLEVEL=0
DISPLAYTLEVEL

(1 row)
???
-- Test of $TLEVEL for EXCEPT ALL : Expect 0
(1 row)
$TLEVEL=0
$TLEVEL=0
DISPLAYTLEVEL
(0 rows)
???
-- Test of $TLEVEL for INSERT INTO : Expect 1
(1 row)
$TLEVEL=1
$TLEVEL=1
$TLEVEL=1
$TLEVEL=1
$TLEVEL=1
$TLEVEL=1
INSERT 0 1
???
-- Test of $TLEVEL for DELETE FROM : Expect 1
(1 row)
$TLEVEL=1
DELETE 1
???
-- Test of $TLEVEL for UPDATE : Expect 1
(1 row)
$TLEVEL=1
UPDATE 1
