# Run [yottadb -run TC039] to generate input.sql
# Run [octo -f input.sql] and verify no SIG-11 etc.
CREATE TABLE
------------------------------------------------------------------------------------------------
# Validate that long DDL definitions are correctly fragmented and retrieved
# Do this by causing a difference in FMT_PLAN_DEFINITION to force retrieval after initial storage
------------------------------------------------------------------------------------------------
# Run [mupip extract run3.ext]
# Determine current plan definition format number (FMT_PLAN_DEFINITION) from run3.ext
# Simulate random prior commit by setting plan definition format number to a smaller value
# Turn on journaling to find out what database nodes get set during auto upgrade
# Run [octo -f empty_query.sql] so auto upgrade of plan definitions happens
ID|COL1|COL2|COL3|COL4|COL5|COL6|COL7|COL8|COL9|COL10|COL11|COL12|COL13|COL14|COL15|COL16|COL17|COL18|COL19|COL20|COL21|COL22|COL23|COL24|COL25|COL26|COL27|COL28|COL29|COL30|COL31|COL32|COL33|COL34|COL35|COL36|COL37|COL38|COL39|COL40|COL41|COL42|COL43|COL44|COL45|COL46|COL47|COL48|COL49|COL50|COL51|COL52|COL53|COL54|COL55|COL56|COL57|COL58|COL59|COL60|COL61|COL62|COL63|COL64|COL65|COL66|COL67|COL68|COL69|COL70|COL71|COL72|COL73|COL74|COL75|COL76|COL77|COL78|COL79|COL80|COL81|COL82|COL83|COL84|COL85|COL86|COL87|COL88|COL89|COL90|COL91|COL92|COL93|COL94|COL95|COL96|COL97|COL98|COL99|COL100|COL101|COL102|COL103|COL104|COL105|COL106|COL107|COL108|COL109|COL110|COL111|COL112|COL113|COL114|COL115|COL116|COL117|COL118|COL119|COL120|COL121|COL122|COL123|COL124|COL125|COL126|COL127|COL128|COL129|COL130|COL131|COL132|COL133|COL134|COL135|COL136|COL137|COL138|COL139|COL140|COL141|COL142|COL143|COL144|COL145|COL146|COL147|COL148|COL149|COL150|COL151|COL152|COL153|COL154|COL155|COL156|COL157|COL158|COL159|COL160|COL161|COL162|COL163|COL164|COL165|COL166|COL167|COL168|COL169|COL170|COL171|COL172|COL173|COL174|COL175|COL176|COL177|COL178|COL179|COL180|COL181|COL182|COL183|COL184|COL185|COL186|COL187|COL188|COL189|COL190|COL191|COL192|COL193|COL194|COL195|COL196|COL197|COL198|COL199|COL200|COL201|COL202|COL203|COL204|COL205|COL206|COL207|COL208|COL209|COL210|COL211|COL212|COL213|COL214|COL215|COL216|COL217|COL218|COL219|COL220|COL221|COL222|COL223|COL224|COL225|COL226|COL227|COL228|COL229|COL230|COL231|COL232|COL233|COL234|COL235|COL236|COL237|COL238|COL239|COL240|COL241|COL242|COL243|COL244|COL245|COL246|COL247|COL248|COL249|COL250|COL251|COL252|COL253|COL254|COL255|COL256|COL257|COL258|COL259|COL260|COL261|COL262|COL263|COL264|COL265|COL266|COL267|COL268|COL269|COL270|COL271|COL272|COL273|COL274|COL275|COL276|COL277|COL278|COL279|COL280|COL281|COL282|COL283|COL284|COL285|COL286|COL287|COL288|COL289|COL290|COL291|COL292|COL293|COL294|COL295|COL296|COL297|COL298|COL299|COL300|COL301|COL302|COL303|COL304|COL305|COL306|COL307|COL308|COL309|COL310|COL311|COL312|COL313|COL314|COL315|COL316|COL317|COL318|COL319|COL320|COL321|COL322|COL323|COL324|COL325|COL326|COL327|COL328|COL329|COL330|COL331|COL332|COL333|COL334|COL335|COL336|COL337|COL338|COL339|COL340|COL341|COL342|COL343|COL344|COL345|COL346|COL347|COL348|COL349|COL350|COL351|COL352|COL353|COL354|COL355|COL356|COL357|COL358|COL359|COL360|COL361|COL362|COL363|COL364|COL365|COL366|COL367|COL368|COL369|COL370|COL371|COL372|COL373|COL374|COL375|COL376|COL377|COL378|COL379|COL380|COL381|COL382|COL383|COL384|COL385|COL386|COL387|COL388|COL389|COL390|COL391|COL392|COL393|COL394|COL395|COL396|COL397|COL398|COL399|COL400|COL401|COL402|COL403|COL404|COL405|COL406|COL407|COL408|COL409|COL410|COL411|COL412|COL413|COL414|COL415|COL416|COL417|COL418|COL419|COL420|COL421|COL422|COL423|COL424|COL425|COL426|COL427|COL428|COL429|COL430|COL431|COL432|COL433|COL434|COL435|COL436|COL437|COL438|COL439|COL440|COL441|COL442|COL443|COL444|COL445|COL446|COL447|COL448|COL449|COL450|COL451|COL452|COL453|COL454|COL455|COL456|COL457|COL458|COL459|COL460|COL461|COL462|COL463|COL464|COL465|COL466|COL467|COL468|COL469|COL470|COL471|COL472|COL473|COL474|COL475|COL476|COL477|COL478|COL479|COL480|COL481|COL482|COL483|COL484|COL485|COL486|COL487|COL488|COL489|COL490|COL491|COL492|COL493|COL494|COL495|COL496|COL497|COL498|COL499|COL500|COL501|COL502|COL503|COL504|COL505|COL506|COL507|COL508|COL509|COL510|COL511|COL512|COL513|COL514|COL515|COL516|COL517|COL518|COL519|COL520|COL521|COL522|COL523|COL524|COL525|COL526|COL527|COL528|COL529|COL530|COL531|COL532|COL533|COL534|COL535|COL536|COL537|COL538|COL539|COL540|COL541|COL542|COL543|COL544|COL545|COL546|COL547|COL548|COL549|COL550|COL551|COL552|COL553|COL554|COL555|COL556|COL557|COL558|COL559|COL560|COL561|COL562|COL563|COL564|COL565|COL566|COL567|COL568|COL569|COL570|COL571|COL572|COL573|COL574|COL575|COL576|COL577|COL578|COL579|COL580|COL581|COL582|COL583|COL584|COL585|COL586|COL587|COL588|COL589|COL590|COL591|COL592|COL593|COL594|COL595|COL596|COL597|COL598|COL599|COL600|COL601|COL602|COL603|COL604|COL605|COL606|COL607|COL608|COL609|COL610|COL611|COL612|COL613|COL614|COL615|COL616|COL617|COL618|COL619|COL620|COL621|COL622|COL623|COL624|COL625|COL626|COL627|COL628|COL629|COL630|COL631|COL632|COL633|COL634|COL635|COL636|COL637|COL638|COL639|COL640|COL641|COL642|COL643|COL644|COL645|COL646|COL647|COL648|COL649|COL650|COL651|COL652|COL653|COL654|COL655|COL656|COL657|COL658|COL659|COL660|COL661|COL662|COL663|COL664|COL665|COL666|COL667|COL668|COL669|COL670|COL671|COL672|COL673|COL674|COL675|COL676|COL677|COL678|COL679|COL680|COL681|COL682|COL683|COL684|COL685|COL686|COL687|COL688|COL689|COL690|COL691|COL692|COL693|COL694|COL695|COL696|COL697|COL698|COL699|COL700|COL701|COL702|COL703|COL704|COL705|COL706|COL707|COL708|COL709|COL710|COL711|COL712|COL713|COL714|COL715|COL716|COL717|COL718|COL719|COL720|COL721|COL722|COL723|COL724|COL725|COL726|COL727|COL728|COL729|COL730|COL731|COL732|COL733|COL734|COL735|COL736|COL737|COL738|COL739|COL740|COL741|COL742|COL743|COL744|COL745|COL746|COL747|COL748|COL749|COL750|COL751|COL752|COL753|COL754|COL755|COL756|COL757|COL758|COL759|COL760|COL761|COL762|COL763|COL764|COL765|COL766|COL767|COL768|COL769|COL770|COL771|COL772|COL773|COL774|COL775|COL776|COL777|COL778|COL779|COL780|COL781|COL782|COL783|COL784|COL785|COL786|COL787|COL788|COL789|COL790|COL791|COL792|COL793|COL794|COL795|COL796|COL797|COL798|COL799|COL800|COL801|COL802|COL803|COL804|COL805|COL806|COL807|COL808|COL809|COL810|COL811|COL812|COL813|COL814|COL815|COL816|COL817|COL818|COL819|COL820|COL821|COL822|COL823|COL824|COL825|COL826|COL827|COL828|COL829|COL830|COL831|COL832|COL833|COL834|COL835|COL836|COL837|COL838|COL839|COL840|COL841|COL842|COL843|COL844|COL845|COL846|COL847|COL848|COL849|COL850|COL851|COL852|COL853|COL854|COL855|COL856|COL857|COL858|COL859|COL860|COL861|COL862|COL863|COL864|COL865|COL866|COL867|COL868|COL869|COL870|COL871|COL872|COL873|COL874|COL875|COL876|COL877|COL878|COL879|COL880|COL881|COL882|COL883|COL884|COL885|COL886|COL887|COL888|COL889|COL890|COL891|COL892|COL893|COL894|COL895|COL896|COL897|COL898|COL899|COL900|COL901|COL902|COL903|COL904|COL905|COL906|COL907|COL908|COL909|COL910|COL911|COL912|COL913|COL914|COL915|COL916|COL917|COL918|COL919|COL920|COL921|COL922|COL923|COL924|COL925|COL926|COL927|COL928|COL929|COL930|COL931|COL932|COL933|COL934|COL935|COL936|COL937|COL938|COL939|COL940|COL941|COL942|COL943|COL944|COL945|COL946|COL947|COL948|COL949|COL950|COL951|COL952|COL953|COL954|COL955|COL956|COL957|COL958|COL959|COL960|COL961|COL962|COL963|COL964|COL965|COL966|COL967|COL968|COL969|COL970|COL971|COL972|COL973|COL974|COL975|COL976|COL977|COL978|COL979|COL980|COL981|COL982|COL983|COL984|COL985|COL986|COL987|COL988|COL989|COL990|COL991|COL992|COL993|COL994|COL995|COL996|COL997|COL998|COL999|COL1000
(0 rows)
# Turn off journaling (no longer needed for this stage of the test)
# Verify that ^%ydboctoocto("planfmt") gets set to current FMT_PLAN_DEFINITION
