{
  "locale": {
    "pt": {
      "noResults": "vish :O\n\nO carrinho está vazio!\nClica pra voltar, bora ver uns stickers lindos!",
      "cartTitle": "Seu carrinho",
      "goToCheckout": "Finalizar compra"
    }
  },
  "test": {
    "ids": {
      "noResults": "cart-empty",
      "backButton": "menu-item-back-button",
      "checkoutButton": "go-to-checkout-button"
    }
  }
}
