// Jest Snapshot v1, https://goo.gl/fbAQLP

exports[`ProductCard should render the basic product information 1`] = `
<DocumentFragment>
  <li
    data-testid="product-list-item"
  >
    <div
      class="MuiPaper-root MuiPaper-elevation1 MuiCard-root makeStyles-card-1 MuiPaper-rounded"
    >
      <div
        class="MuiCardHeader-root"
        data-testid="product-name"
      >
        <div
          class="MuiCardHeader-content"
        >
          <span
            class="MuiTypography-root MuiCardHeader-title MuiTypography-h5 MuiTypography-displayBlock"
            style="font-family: Calistoga;"
          >
            Elephanto
          </span>
        </div>
        <div
          class="MuiCardHeader-action"
        >
          <a
            aria-disabled="false"
            class="MuiButtonBase-root MuiButton-root MuiButton-text makeStyles-details-3"
            data-testid="product-view-details"
            href="/products/1"
            role="button"
            tabindex="0"
          >
            <span
              class="MuiButton-label"
            >
              + Detalhes
            </span>
            <span
              class="MuiTouchRipple-root"
            />
          </a>
        </div>
      </div>
      <button
        class="MuiButtonBase-root MuiCardActionArea-root"
        tabindex="0"
        type="button"
      >
        <div
          class="MuiCardMedia-root makeStyles-media-2"
          data-testid="product-image"
          style="background-image: url(/assets/elephant.png);"
          title="Picture of the product Elephanto"
        />
        <span
          class="MuiCardActionArea-focusHighlight"
        />
        <span
          class="MuiTouchRipple-root"
        />
      </button>
      <div
        class="MuiCardContent-root"
      >
        <div
          class="MuiGrid-root MuiGrid-container MuiGrid-justify-xs-space-between"
        >
          <div
            class="MuiGrid-root MuiGrid-item"
          >
            <s>
              <h4
                class="MuiTypography-root MuiTypography-h6 MuiTypography-colorSecondary MuiTypography-alignRight"
                data-testid="product-value"
                style="font-family: Calistoga;"
              >
                De R$ 5,00
              </h4>
            </s>
          </div>
          <div
            class="MuiGrid-root MuiGrid-item"
          >
            <h4
              class="MuiTypography-root MuiTypography-h4 MuiTypography-gutterBottom MuiTypography-alignRight"
              data-testid="product-price"
              style="font-family: Calistoga;"
            >
              R$ 4,00
            </h4>
          </div>
        </div>
        <div
          class="MuiButtonGroup-root MuiButtonGroup-fullWidth"
          role="group"
        >
          <button
            class="MuiButtonBase-root MuiButton-root MuiButton-contained MuiButtonGroup-grouped MuiButtonGroup-groupedOutlined MuiButtonGroup-groupedOutlined MuiButton-containedPrimary MuiButton-fullWidth"
            data-testid="product-add-to-cart"
            tabindex="0"
            type="button"
          >
            <span
              class="MuiButton-label"
            >
              Comprar
              <span
                class="MuiButton-endIcon MuiButton-iconSizeMedium"
              >
                <svg
                  aria-hidden="true"
                  class="MuiSvgIcon-root"
                  focusable="false"
                  role="presentation"
                  viewBox="0 0 24 24"
                >
                  <path
                    d="M11 9h2V6h3V4h-3V1h-2v3H8v2h3v3zm-4 9c-1.1 0-1.99.9-1.99 2S5.9 22 7 22s2-.9 2-2-.9-2-2-2zm10 0c-1.1 0-1.99.9-1.99 2s.89 2 1.99 2 2-.9 2-2-.9-2-2-2zm-8.9-5h7.45c.75 0 1.41-.41 1.75-1.03l3.86-7.01L19.42 4l-3.87 7H8.53L4.27 2H1v2h2l3.6 7.59-1.35 2.44C4.52 15.37 5.48 17 7 17h12v-2H7l1.1-2z"
                  />
                </svg>
              </span>
            </span>
            <span
              class="MuiTouchRipple-root"
            />
          </button>
        </div>
      </div>
    </div>
  </li>
</DocumentFragment>
`;
