%YAML 1.1
%TAG !u! tag:unity3d.com,2011:
--- !u!1045 &1
EditorBuildSettings:
  m_ObjectHideFlags: 0
  serializedVersion: 2
  m_Scenes:
  - enabled: 1
    path: Assets/Scenes/House_1.unity
    guid: 4b8c9a4e1fa47794b9ba4eb91c852c46
  - enabled: 1
    path: Assets/Scenes/House_2.unity
    guid: 86af9ffd74fc7534ba8b337ba13787c6
  - enabled: 1
    path: Assets/Scenes/Forest.unity
    guid: 2cda990e2423bbf4892e6590ba056729
  - enabled: 1
    path: Assets/Scenes/Cave.unity
    guid: e68dfbaa0ad7bad4b91c1669b682c09b
  m_configObjects: {}
