%YAML 1.1
%TAG !u! tag:unity3d.com,2011:
--- !u!1 &7036964940527805051
GameObject:
  m_ObjectHideFlags: 0
  m_CorrespondingSourceObject: {fileID: 0}
  m_PrefabInstance: {fileID: 0}
  m_PrefabAsset: {fileID: 0}
  serializedVersion: 6
  m_Component:
  - component: {fileID: 8264522815178636798}
  - component: {fileID: 3408280171602690346}
  - component: {fileID: 7131279842362445334}
  m_Layer: 31
  m_Name: Layer1
  m_TagString: Untagged
  m_Icon: {fileID: 0}
  m_NavMeshLayer: 0
  m_StaticEditorFlags: 0
  m_IsActive: 1
--- !u!4 &8264522815178636798
Transform:
  m_ObjectHideFlags: 0
  m_CorrespondingSourceObject: {fileID: 0}
  m_PrefabInstance: {fileID: 0}
  m_PrefabAsset: {fileID: 0}
  m_GameObject: {fileID: 7036964940527805051}
  m_LocalRotation: {x: -0, y: -0, z: -0, w: 1}
  m_LocalPosition: {x: 0, y: 0, z: 0}
  m_LocalScale: {x: 1, y: 1, z: 1}
  m_Children: []
  m_Father: {fileID: 8841216456052420047}
  m_RootOrder: 0
  m_LocalEulerAnglesHint: {x: 0, y: 0, z: 0}
--- !u!1839735485 &3408280171602690346
Tilemap:
  m_ObjectHideFlags: 0
  m_CorrespondingSourceObject: {fileID: 0}
  m_PrefabInstance: {fileID: 0}
  m_PrefabAsset: {fileID: 0}
  m_GameObject: {fileID: 7036964940527805051}
  m_Enabled: 1
  m_Tiles:
  - first: {x: 8, y: -17, z: 0}
    second:
      serializedVersion: 2
      m_TileIndex: 155
      m_TileSpriteIndex: 154
      m_TileMatrixIndex: 0
      m_TileColorIndex: 0
      m_TileObjectToInstantiateIndex: 65535
      m_AllTileFlags: 1073741825
  - first: {x: 2, y: -15, z: 0}
    second:
      serializedVersion: 2
      m_TileIndex: 150
      m_TileSpriteIndex: 150
      m_TileMatrixIndex: 0
      m_TileColorIndex: 0
      m_TileObjectToInstantiateIndex: 65535
      m_AllTileFlags: 1073741825
  - first: {x: 3, y: -15, z: 0}
    second:
      serializedVersion: 2
      m_TileIndex: 151
      m_TileSpriteIndex: 151
      m_TileMatrixIndex: 0
      m_TileColorIndex: 0
      m_TileObjectToInstantiateIndex: 65535
      m_AllTileFlags: 1073741825
  - first: {x: 4, y: -15, z: 0}
    second:
      serializedVersion: 2
      m_TileIndex: 152
      m_TileSpriteIndex: 152
      m_TileMatrixIndex: 0
      m_TileColorIndex: 0
      m_TileObjectToInstantiateIndex: 65535
      m_AllTileFlags: 1073741825
  - first: {x: 7, y: -15, z: 0}
    second:
      serializedVersion: 2
      m_TileIndex: 153
      m_TileSpriteIndex: 153
      m_TileMatrixIndex: 0
      m_TileColorIndex: 0
      m_TileObjectToInstantiateIndex: 65535
      m_AllTileFlags: 1073741825
  - first: {x: 8, y: -15, z: 0}
    second:
      serializedVersion: 2
      m_TileIndex: 154
      m_TileSpriteIndex: 154
      m_TileMatrixIndex: 0
      m_TileColorIndex: 0
      m_TileObjectToInstantiateIndex: 65535
      m_AllTileFlags: 1073741825
  - first: {x: 2, y: -14, z: 0}
    second:
      serializedVersion: 2
      m_TileIndex: 145
      m_TileSpriteIndex: 145
      m_TileMatrixIndex: 0
      m_TileColorIndex: 0
      m_TileObjectToInstantiateIndex: 65535
      m_AllTileFlags: 1073741825
  - first: {x: 3, y: -14, z: 0}
    second:
      serializedVersion: 2
      m_TileIndex: 146
      m_TileSpriteIndex: 146
      m_TileMatrixIndex: 0
      m_TileColorIndex: 0
      m_TileObjectToInstantiateIndex: 65535
      m_AllTileFlags: 1073741825
  - first: {x: 4, y: -14, z: 0}
    second:
      serializedVersion: 2
      m_TileIndex: 147
      m_TileSpriteIndex: 147
      m_TileMatrixIndex: 0
      m_TileColorIndex: 0
      m_TileObjectToInstantiateIndex: 65535
      m_AllTileFlags: 1073741825
  - first: {x: 12, y: -14, z: 0}
    second:
      serializedVersion: 2
      m_TileIndex: 148
      m_TileSpriteIndex: 148
      m_TileMatrixIndex: 0
      m_TileColorIndex: 0
      m_TileObjectToInstantiateIndex: 65535
      m_AllTileFlags: 1073741825
  - first: {x: 13, y: -14, z: 0}
    second:
      serializedVersion: 2
      m_TileIndex: 149
      m_TileSpriteIndex: 149
      m_TileMatrixIndex: 0
      m_TileColorIndex: 0
      m_TileObjectToInstantiateIndex: 65535
      m_AllTileFlags: 1073741825
  - first: {x: -1, y: -13, z: 0}
    second:
      serializedVersion: 2
      m_TileIndex: 136
      m_TileSpriteIndex: 136
      m_TileMatrixIndex: 0
      m_TileColorIndex: 0
      m_TileObjectToInstantiateIndex: 65535
      m_AllTileFlags: 1073741825
  - first: {x: 2, y: -13, z: 0}
    second:
      serializedVersion: 2
      m_TileIndex: 137
      m_TileSpriteIndex: 137
      m_TileMatrixIndex: 0
      m_TileColorIndex: 0
      m_TileObjectToInstantiateIndex: 65535
      m_AllTileFlags: 1073741825
  - first: {x: 3, y: -13, z: 0}
    second:
      serializedVersion: 2
      m_TileIndex: 138
      m_TileSpriteIndex: 138
      m_TileMatrixIndex: 0
      m_TileColorIndex: 0
      m_TileObjectToInstantiateIndex: 65535
      m_AllTileFlags: 1073741825
  - first: {x: 4, y: -13, z: 0}
    second:
      serializedVersion: 2
      m_TileIndex: 139
      m_TileSpriteIndex: 139
      m_TileMatrixIndex: 0
      m_TileColorIndex: 0
      m_TileObjectToInstantiateIndex: 65535
      m_AllTileFlags: 1073741825
  - first: {x: 6, y: -13, z: 0}
    second:
      serializedVersion: 2
      m_TileIndex: 140
      m_TileSpriteIndex: 140
      m_TileMatrixIndex: 0
      m_TileColorIndex: 0
      m_TileObjectToInstantiateIndex: 65535
      m_AllTileFlags: 1073741825
  - first: {x: 12, y: -13, z: 0}
    second:
      serializedVersion: 2
      m_TileIndex: 141
      m_TileSpriteIndex: 141
      m_TileMatrixIndex: 0
      m_TileColorIndex: 0
      m_TileObjectToInstantiateIndex: 65535
      m_AllTileFlags: 1073741825
  - first: {x: 13, y: -13, z: 0}
    second:
      serializedVersion: 2
      m_TileIndex: 142
      m_TileSpriteIndex: 142
      m_TileMatrixIndex: 0
      m_TileColorIndex: 0
      m_TileObjectToInstantiateIndex: 65535
      m_AllTileFlags: 1073741825
  - first: {x: 14, y: -13, z: 0}
    second:
      serializedVersion: 2
      m_TileIndex: 143
      m_TileSpriteIndex: 143
      m_TileMatrixIndex: 0
      m_TileColorIndex: 0
      m_TileObjectToInstantiateIndex: 65535
      m_AllTileFlags: 1073741825
  - first: {x: 15, y: -13, z: 0}
    second:
      serializedVersion: 2
      m_TileIndex: 144
      m_TileSpriteIndex: 144
      m_TileMatrixIndex: 0
      m_TileColorIndex: 0
      m_TileObjectToInstantiateIndex: 65535
      m_AllTileFlags: 1073741825
  - first: {x: -2, y: -12, z: 0}
    second:
      serializedVersion: 2
      m_TileIndex: 130
      m_TileSpriteIndex: 130
      m_TileMatrixIndex: 0
      m_TileColorIndex: 0
      m_TileObjectToInstantiateIndex: 65535
      m_AllTileFlags: 1073741825
  - first: {x: 0, y: -12, z: 0}
    second:
      serializedVersion: 2
      m_TileIndex: 131
      m_TileSpriteIndex: 131
      m_TileMatrixIndex: 0
      m_TileColorIndex: 0
      m_TileObjectToInstantiateIndex: 65535
      m_AllTileFlags: 1073741825
  - first: {x: 5, y: -12, z: 0}
    second:
      serializedVersion: 2
      m_TileIndex: 132
      m_TileSpriteIndex: 132
      m_TileMatrixIndex: 0
      m_TileColorIndex: 0
      m_TileObjectToInstantiateIndex: 65535
      m_AllTileFlags: 1073741825
  - first: {x: 7, y: -12, z: 0}
    second:
      serializedVersion: 2
      m_TileIndex: 133
      m_TileSpriteIndex: 133
      m_TileMatrixIndex: 0
      m_TileColorIndex: 0
      m_TileObjectToInstantiateIndex: 65535
      m_AllTileFlags: 1073741825
  - first: {x: 14, y: -12, z: 0}
    second:
      serializedVersion: 2
      m_TileIndex: 134
      m_TileSpriteIndex: 134
      m_TileMatrixIndex: 0
      m_TileColorIndex: 0
      m_TileObjectToInstantiateIndex: 65535
      m_AllTileFlags: 1073741825
  - first: {x: 15, y: -12, z: 0}
    second:
      serializedVersion: 2
      m_TileIndex: 135
      m_TileSpriteIndex: 135
      m_TileMatrixIndex: 0
      m_TileColorIndex: 0
      m_TileObjectToInstantiateIndex: 65535
      m_AllTileFlags: 1073741825
  - first: {x: -1, y: -11, z: 0}
    second:
      serializedVersion: 2
      m_TileIndex: 128
      m_TileSpriteIndex: 128
      m_TileMatrixIndex: 0
      m_TileColorIndex: 0
      m_TileObjectToInstantiateIndex: 65535
      m_AllTileFlags: 1073741825
  - first: {x: 6, y: -11, z: 0}
    second:
      serializedVersion: 2
      m_TileIndex: 129
      m_TileSpriteIndex: 129
      m_TileMatrixIndex: 0
      m_TileColorIndex: 0
      m_TileObjectToInstantiateIndex: 65535
      m_AllTileFlags: 1073741825
  - first: {x: 8, y: -10, z: 0}
    second:
      serializedVersion: 2
      m_TileIndex: 126
      m_TileSpriteIndex: 126
      m_TileMatrixIndex: 0
      m_TileColorIndex: 0
      m_TileObjectToInstantiateIndex: 65535
      m_AllTileFlags: 1073741825
  - first: {x: 10, y: -10, z: 0}
    second:
      serializedVersion: 2
      m_TileIndex: 127
      m_TileSpriteIndex: 127
      m_TileMatrixIndex: 0
      m_TileColorIndex: 0
      m_TileObjectToInstantiateIndex: 65535
      m_AllTileFlags: 1073741825
  - first: {x: 2, y: -9, z: 0}
    second:
      serializedVersion: 2
      m_TileIndex: 119
      m_TileSpriteIndex: 119
      m_TileMatrixIndex: 0
      m_TileColorIndex: 0
      m_TileObjectToInstantiateIndex: 65535
      m_AllTileFlags: 1073741825
  - first: {x: 3, y: -9, z: 0}
    second:
      serializedVersion: 2
      m_TileIndex: 120
      m_TileSpriteIndex: 120
      m_TileMatrixIndex: 0
      m_TileColorIndex: 0
      m_TileObjectToInstantiateIndex: 65535
      m_AllTileFlags: 1073741825
  - first: {x: 4, y: -9, z: 0}
    second:
      serializedVersion: 2
      m_TileIndex: 121
      m_TileSpriteIndex: 121
      m_TileMatrixIndex: 0
      m_TileColorIndex: 0
      m_TileObjectToInstantiateIndex: 65535
      m_AllTileFlags: 1073741825
  - first: {x: 5, y: -9, z: 0}
    second:
      serializedVersion: 2
      m_TileIndex: 122
      m_TileSpriteIndex: 122
      m_TileMatrixIndex: 0
      m_TileColorIndex: 0
      m_TileObjectToInstantiateIndex: 65535
      m_AllTileFlags: 1073741825
  - first: {x: 6, y: -9, z: 0}
    second:
      serializedVersion: 2
      m_TileIndex: 123
      m_TileSpriteIndex: 123
      m_TileMatrixIndex: 0
      m_TileColorIndex: 0
      m_TileObjectToInstantiateIndex: 65535
      m_AllTileFlags: 1073741825
  - first: {x: 9, y: -9, z: 0}
    second:
      serializedVersion: 2
      m_TileIndex: 124
      m_TileSpriteIndex: 124
      m_TileMatrixIndex: 0
      m_TileColorIndex: 0
      m_TileObjectToInstantiateIndex: 65535
      m_AllTileFlags: 1073741825
  - first: {x: 11, y: -9, z: 0}
    second:
      serializedVersion: 2
      m_TileIndex: 125
      m_TileSpriteIndex: 125
      m_TileMatrixIndex: 0
      m_TileColorIndex: 0
      m_TileObjectToInstantiateIndex: 65535
      m_AllTileFlags: 1073741825
  - first: {x: -2, y: -8, z: 0}
    second:
      serializedVersion: 2
      m_TileIndex: 104
      m_TileSpriteIndex: 104
      m_TileMatrixIndex: 0
      m_TileColorIndex: 0
      m_TileObjectToInstantiateIndex: 65535
      m_AllTileFlags: 1073741825
  - first: {x: -1, y: -8, z: 0}
    second:
      serializedVersion: 2
      m_TileIndex: 105
      m_TileSpriteIndex: 105
      m_TileMatrixIndex: 0
      m_TileColorIndex: 0
      m_TileObjectToInstantiateIndex: 65535
      m_AllTileFlags: 1073741825
  - first: {x: 0, y: -8, z: 0}
    second:
      serializedVersion: 2
      m_TileIndex: 106
      m_TileSpriteIndex: 106
      m_TileMatrixIndex: 0
      m_TileColorIndex: 0
      m_TileObjectToInstantiateIndex: 65535
      m_AllTileFlags: 1073741825
  - first: {x: 1, y: -8, z: 0}
    second:
      serializedVersion: 2
      m_TileIndex: 107
      m_TileSpriteIndex: 107
      m_TileMatrixIndex: 0
      m_TileColorIndex: 0
      m_TileObjectToInstantiateIndex: 65535
      m_AllTileFlags: 1073741825
  - first: {x: 2, y: -8, z: 0}
    second:
      serializedVersion: 2
      m_TileIndex: 108
      m_TileSpriteIndex: 108
      m_TileMatrixIndex: 0
      m_TileColorIndex: 0
      m_TileObjectToInstantiateIndex: 65535
      m_AllTileFlags: 1073741825
  - first: {x: 3, y: -8, z: 0}
    second:
      serializedVersion: 2
      m_TileIndex: 109
      m_TileSpriteIndex: 109
      m_TileMatrixIndex: 0
      m_TileColorIndex: 0
      m_TileObjectToInstantiateIndex: 65535
      m_AllTileFlags: 1073741825
  - first: {x: 4, y: -8, z: 0}
    second:
      serializedVersion: 2
      m_TileIndex: 110
      m_TileSpriteIndex: 110
      m_TileMatrixIndex: 0
      m_TileColorIndex: 0
      m_TileObjectToInstantiateIndex: 65535
      m_AllTileFlags: 1073741825
  - first: {x: 5, y: -8, z: 0}
    second:
      serializedVersion: 2
      m_TileIndex: 111
      m_TileSpriteIndex: 111
      m_TileMatrixIndex: 0
      m_TileColorIndex: 0
      m_TileObjectToInstantiateIndex: 65535
      m_AllTileFlags: 1073741825
  - first: {x: 6, y: -8, z: 0}
    second:
      serializedVersion: 2
      m_TileIndex: 112
      m_TileSpriteIndex: 112
      m_TileMatrixIndex: 0
      m_TileColorIndex: 0
      m_TileObjectToInstantiateIndex: 65535
      m_AllTileFlags: 1073741825
  - first: {x: 7, y: -8, z: 0}
    second:
      serializedVersion: 2
      m_TileIndex: 113
      m_TileSpriteIndex: 113
      m_TileMatrixIndex: 0
      m_TileColorIndex: 0
      m_TileObjectToInstantiateIndex: 65535
      m_AllTileFlags: 1073741825
  - first: {x: 8, y: -8, z: 0}
    second:
      serializedVersion: 2
      m_TileIndex: 114
      m_TileSpriteIndex: 114
      m_TileMatrixIndex: 0
      m_TileColorIndex: 0
      m_TileObjectToInstantiateIndex: 65535
      m_AllTileFlags: 1073741825
  - first: {x: 10, y: -8, z: 0}
    second:
      serializedVersion: 2
      m_TileIndex: 115
      m_TileSpriteIndex: 115
      m_TileMatrixIndex: 0
      m_TileColorIndex: 0
      m_TileObjectToInstantiateIndex: 65535
      m_AllTileFlags: 1073741825
  - first: {x: 14, y: -8, z: 0}
    second:
      serializedVersion: 2
      m_TileIndex: 116
      m_TileSpriteIndex: 116
      m_TileMatrixIndex: 0
      m_TileColorIndex: 0
      m_TileObjectToInstantiateIndex: 65535
      m_AllTileFlags: 1073741825
  - first: {x: 16, y: -8, z: 0}
    second:
      serializedVersion: 2
      m_TileIndex: 117
      m_TileSpriteIndex: 117
      m_TileMatrixIndex: 0
      m_TileColorIndex: 0
      m_TileObjectToInstantiateIndex: 65535
      m_AllTileFlags: 1073741825
  - first: {x: 18, y: -8, z: 0}
    second:
      serializedVersion: 2
      m_TileIndex: 118
      m_TileSpriteIndex: 118
      m_TileMatrixIndex: 0
      m_TileColorIndex: 0
      m_TileObjectToInstantiateIndex: 65535
      m_AllTileFlags: 1073741825
  - first: {x: -2, y: -7, z: 0}
    second:
      serializedVersion: 2
      m_TileIndex: 90
      m_TileSpriteIndex: 90
      m_TileMatrixIndex: 0
      m_TileColorIndex: 0
      m_TileObjectToInstantiateIndex: 65535
      m_AllTileFlags: 1073741825
  - first: {x: -1, y: -7, z: 0}
    second:
      serializedVersion: 2
      m_TileIndex: 91
      m_TileSpriteIndex: 91
      m_TileMatrixIndex: 0
      m_TileColorIndex: 0
      m_TileObjectToInstantiateIndex: 65535
      m_AllTileFlags: 1073741825
  - first: {x: 0, y: -7, z: 0}
    second:
      serializedVersion: 2
      m_TileIndex: 92
      m_TileSpriteIndex: 92
      m_TileMatrixIndex: 0
      m_TileColorIndex: 0
      m_TileObjectToInstantiateIndex: 65535
      m_AllTileFlags: 1073741825
  - first: {x: 1, y: -7, z: 0}
    second:
      serializedVersion: 2
      m_TileIndex: 93
      m_TileSpriteIndex: 93
      m_TileMatrixIndex: 0
      m_TileColorIndex: 0
      m_TileObjectToInstantiateIndex: 65535
      m_AllTileFlags: 1073741825
  - first: {x: 2, y: -7, z: 0}
    second:
      serializedVersion: 2
      m_TileIndex: 94
      m_TileSpriteIndex: 94
      m_TileMatrixIndex: 0
      m_TileColorIndex: 0
      m_TileObjectToInstantiateIndex: 65535
      m_AllTileFlags: 1073741825
  - first: {x: 3, y: -7, z: 0}
    second:
      serializedVersion: 2
      m_TileIndex: 95
      m_TileSpriteIndex: 95
      m_TileMatrixIndex: 0
      m_TileColorIndex: 0
      m_TileObjectToInstantiateIndex: 65535
      m_AllTileFlags: 1073741825
  - first: {x: 4, y: -7, z: 0}
    second:
      serializedVersion: 2
      m_TileIndex: 96
      m_TileSpriteIndex: 96
      m_TileMatrixIndex: 0
      m_TileColorIndex: 0
      m_TileObjectToInstantiateIndex: 65535
      m_AllTileFlags: 1073741825
  - first: {x: 5, y: -7, z: 0}
    second:
      serializedVersion: 2
      m_TileIndex: 97
      m_TileSpriteIndex: 97
      m_TileMatrixIndex: 0
      m_TileColorIndex: 0
      m_TileObjectToInstantiateIndex: 65535
      m_AllTileFlags: 1073741825
  - first: {x: 6, y: -7, z: 0}
    second:
      serializedVersion: 2
      m_TileIndex: 98
      m_TileSpriteIndex: 98
      m_TileMatrixIndex: 0
      m_TileColorIndex: 0
      m_TileObjectToInstantiateIndex: 65535
      m_AllTileFlags: 1073741825
  - first: {x: 7, y: -7, z: 0}
    second:
      serializedVersion: 2
      m_TileIndex: 99
      m_TileSpriteIndex: 99
      m_TileMatrixIndex: 0
      m_TileColorIndex: 0
      m_TileObjectToInstantiateIndex: 65535
      m_AllTileFlags: 1073741825
  - first: {x: 8, y: -7, z: 0}
    second:
      serializedVersion: 2
      m_TileIndex: 100
      m_TileSpriteIndex: 100
      m_TileMatrixIndex: 0
      m_TileColorIndex: 0
      m_TileObjectToInstantiateIndex: 65535
      m_AllTileFlags: 1073741825
  - first: {x: 11, y: -7, z: 0}
    second:
      serializedVersion: 2
      m_TileIndex: 101
      m_TileSpriteIndex: 101
      m_TileMatrixIndex: 0
      m_TileColorIndex: 0
      m_TileObjectToInstantiateIndex: 65535
      m_AllTileFlags: 1073741825
  - first: {x: 14, y: -7, z: 0}
    second:
      serializedVersion: 2
      m_TileIndex: 102
      m_TileSpriteIndex: 102
      m_TileMatrixIndex: 0
      m_TileColorIndex: 0
      m_TileObjectToInstantiateIndex: 65535
      m_AllTileFlags: 1073741825
  - first: {x: 18, y: -7, z: 0}
    second:
      serializedVersion: 2
      m_TileIndex: 103
      m_TileSpriteIndex: 103
      m_TileMatrixIndex: 0
      m_TileColorIndex: 0
      m_TileObjectToInstantiateIndex: 65535
      m_AllTileFlags: 1073741825
  - first: {x: -2, y: -6, z: 0}
    second:
      serializedVersion: 2
      m_TileIndex: 76
      m_TileSpriteIndex: 76
      m_TileMatrixIndex: 0
      m_TileColorIndex: 0
      m_TileObjectToInstantiateIndex: 65535
      m_AllTileFlags: 1073741825
  - first: {x: -1, y: -6, z: 0}
    second:
      serializedVersion: 2
      m_TileIndex: 77
      m_TileSpriteIndex: 77
      m_TileMatrixIndex: 0
      m_TileColorIndex: 0
      m_TileObjectToInstantiateIndex: 65535
      m_AllTileFlags: 1073741825
  - first: {x: 0, y: -6, z: 0}
    second:
      serializedVersion: 2
      m_TileIndex: 78
      m_TileSpriteIndex: 78
      m_TileMatrixIndex: 0
      m_TileColorIndex: 0
      m_TileObjectToInstantiateIndex: 65535
      m_AllTileFlags: 1073741825
  - first: {x: 1, y: -6, z: 0}
    second:
      serializedVersion: 2
      m_TileIndex: 79
      m_TileSpriteIndex: 79
      m_TileMatrixIndex: 0
      m_TileColorIndex: 0
      m_TileObjectToInstantiateIndex: 65535
      m_AllTileFlags: 1073741825
  - first: {x: 2, y: -6, z: 0}
    second:
      serializedVersion: 2
      m_TileIndex: 80
      m_TileSpriteIndex: 80
      m_TileMatrixIndex: 0
      m_TileColorIndex: 0
      m_TileObjectToInstantiateIndex: 65535
      m_AllTileFlags: 1073741825
  - first: {x: 3, y: -6, z: 0}
    second:
      serializedVersion: 2
      m_TileIndex: 81
      m_TileSpriteIndex: 81
      m_TileMatrixIndex: 0
      m_TileColorIndex: 0
      m_TileObjectToInstantiateIndex: 65535
      m_AllTileFlags: 1073741825
  - first: {x: 4, y: -6, z: 0}
    second:
      serializedVersion: 2
      m_TileIndex: 82
      m_TileSpriteIndex: 82
      m_TileMatrixIndex: 0
      m_TileColorIndex: 0
      m_TileObjectToInstantiateIndex: 65535
      m_AllTileFlags: 1073741825
  - first: {x: 5, y: -6, z: 0}
    second:
      serializedVersion: 2
      m_TileIndex: 83
      m_TileSpriteIndex: 83
      m_TileMatrixIndex: 0
      m_TileColorIndex: 0
      m_TileObjectToInstantiateIndex: 65535
      m_AllTileFlags: 1073741825
  - first: {x: 6, y: -6, z: 0}
    second:
      serializedVersion: 2
      m_TileIndex: 84
      m_TileSpriteIndex: 84
      m_TileMatrixIndex: 0
      m_TileColorIndex: 0
      m_TileObjectToInstantiateIndex: 65535
      m_AllTileFlags: 1073741825
  - first: {x: 7, y: -6, z: 0}
    second:
      serializedVersion: 2
      m_TileIndex: 85
      m_TileSpriteIndex: 85
      m_TileMatrixIndex: 0
      m_TileColorIndex: 0
      m_TileObjectToInstantiateIndex: 65535
      m_AllTileFlags: 1073741825
  - first: {x: 10, y: -6, z: 0}
    second:
      serializedVersion: 2
      m_TileIndex: 86
      m_TileSpriteIndex: 86
      m_TileMatrixIndex: 0
      m_TileColorIndex: 0
      m_TileObjectToInstantiateIndex: 65535
      m_AllTileFlags: 1073741825
  - first: {x: 14, y: -6, z: 0}
    second:
      serializedVersion: 2
      m_TileIndex: 87
      m_TileSpriteIndex: 87
      m_TileMatrixIndex: 0
      m_TileColorIndex: 0
      m_TileObjectToInstantiateIndex: 65535
      m_AllTileFlags: 1073741825
  - first: {x: 16, y: -6, z: 0}
    second:
      serializedVersion: 2
      m_TileIndex: 88
      m_TileSpriteIndex: 88
      m_TileMatrixIndex: 0
      m_TileColorIndex: 0
      m_TileObjectToInstantiateIndex: 65535
      m_AllTileFlags: 1073741825
  - first: {x: 18, y: -6, z: 0}
    second:
      serializedVersion: 2
      m_TileIndex: 89
      m_TileSpriteIndex: 89
      m_TileMatrixIndex: 0
      m_TileColorIndex: 0
      m_TileObjectToInstantiateIndex: 65535
      m_AllTileFlags: 1073741825
  - first: {x: -2, y: -5, z: 0}
    second:
      serializedVersion: 2
      m_TileIndex: 66
      m_TileSpriteIndex: 66
      m_TileMatrixIndex: 0
      m_TileColorIndex: 0
      m_TileObjectToInstantiateIndex: 65535
      m_AllTileFlags: 1073741825
  - first: {x: -1, y: -5, z: 0}
    second:
      serializedVersion: 2
      m_TileIndex: 67
      m_TileSpriteIndex: 67
      m_TileMatrixIndex: 0
      m_TileColorIndex: 0
      m_TileObjectToInstantiateIndex: 65535
      m_AllTileFlags: 1073741825
  - first: {x: 0, y: -5, z: 0}
    second:
      serializedVersion: 2
      m_TileIndex: 68
      m_TileSpriteIndex: 68
      m_TileMatrixIndex: 0
      m_TileColorIndex: 0
      m_TileObjectToInstantiateIndex: 65535
      m_AllTileFlags: 1073741825
  - first: {x: 1, y: -5, z: 0}
    second:
      serializedVersion: 2
      m_TileIndex: 69
      m_TileSpriteIndex: 69
      m_TileMatrixIndex: 0
      m_TileColorIndex: 0
      m_TileObjectToInstantiateIndex: 65535
      m_AllTileFlags: 1073741825
  - first: {x: 2, y: -5, z: 0}
    second:
      serializedVersion: 2
      m_TileIndex: 70
      m_TileSpriteIndex: 70
      m_TileMatrixIndex: 0
      m_TileColorIndex: 0
      m_TileObjectToInstantiateIndex: 65535
      m_AllTileFlags: 1073741825
  - first: {x: 3, y: -5, z: 0}
    second:
      serializedVersion: 2
      m_TileIndex: 71
      m_TileSpriteIndex: 71
      m_TileMatrixIndex: 0
      m_TileColorIndex: 0
      m_TileObjectToInstantiateIndex: 65535
      m_AllTileFlags: 1073741825
  - first: {x: 4, y: -5, z: 0}
    second:
      serializedVersion: 2
      m_TileIndex: 72
      m_TileSpriteIndex: 72
      m_TileMatrixIndex: 0
      m_TileColorIndex: 0
      m_TileObjectToInstantiateIndex: 65535
      m_AllTileFlags: 1073741825
  - first: {x: 5, y: -5, z: 0}
    second:
      serializedVersion: 2
      m_TileIndex: 73
      m_TileSpriteIndex: 73
      m_TileMatrixIndex: 0
      m_TileColorIndex: 0
      m_TileObjectToInstantiateIndex: 65535
      m_AllTileFlags: 1073741825
  - first: {x: 6, y: -5, z: 0}
    second:
      serializedVersion: 2
      m_TileIndex: 74
      m_TileSpriteIndex: 74
      m_TileMatrixIndex: 0
      m_TileColorIndex: 0
      m_TileObjectToInstantiateIndex: 65535
      m_AllTileFlags: 1073741825
  - first: {x: 7, y: -5, z: 0}
    second:
      serializedVersion: 2
      m_TileIndex: 75
      m_TileSpriteIndex: 75
      m_TileMatrixIndex: 0
      m_TileColorIndex: 0
      m_TileObjectToInstantiateIndex: 65535
      m_AllTileFlags: 1073741825
  - first: {x: 9, y: -4, z: 0}
    second:
      serializedVersion: 2
      m_TileIndex: 64
      m_TileSpriteIndex: 64
      m_TileMatrixIndex: 0
      m_TileColorIndex: 0
      m_TileObjectToInstantiateIndex: 65535
      m_AllTileFlags: 1073741825
  - first: {x: 10, y: -4, z: 0}
    second:
      serializedVersion: 2
      m_TileIndex: 65
      m_TileSpriteIndex: 65
      m_TileMatrixIndex: 0
      m_TileColorIndex: 0
      m_TileObjectToInstantiateIndex: 65535
      m_AllTileFlags: 1073741825
  - first: {x: 2, y: -3, z: 0}
    second:
      serializedVersion: 2
      m_TileIndex: 55
      m_TileSpriteIndex: 55
      m_TileMatrixIndex: 0
      m_TileColorIndex: 0
      m_TileObjectToInstantiateIndex: 65535
      m_AllTileFlags: 1073741825
  - first: {x: 3, y: -3, z: 0}
    second:
      serializedVersion: 2
      m_TileIndex: 56
      m_TileSpriteIndex: 56
      m_TileMatrixIndex: 0
      m_TileColorIndex: 0
      m_TileObjectToInstantiateIndex: 65535
      m_AllTileFlags: 1073741825
  - first: {x: 4, y: -3, z: 0}
    second:
      serializedVersion: 2
      m_TileIndex: 57
      m_TileSpriteIndex: 57
      m_TileMatrixIndex: 0
      m_TileColorIndex: 0
      m_TileObjectToInstantiateIndex: 65535
      m_AllTileFlags: 1073741825
  - first: {x: 5, y: -3, z: 0}
    second:
      serializedVersion: 2
      m_TileIndex: 58
      m_TileSpriteIndex: 58
      m_TileMatrixIndex: 0
      m_TileColorIndex: 0
      m_TileObjectToInstantiateIndex: 65535
      m_AllTileFlags: 1073741825
  - first: {x: 6, y: -3, z: 0}
    second:
      serializedVersion: 2
      m_TileIndex: 59
      m_TileSpriteIndex: 59
      m_TileMatrixIndex: 0
      m_TileColorIndex: 0
      m_TileObjectToInstantiateIndex: 65535
      m_AllTileFlags: 1073741825
  - first: {x: 10, y: -3, z: 0}
    second:
      serializedVersion: 2
      m_TileIndex: 60
      m_TileSpriteIndex: 60
      m_TileMatrixIndex: 0
      m_TileColorIndex: 0
      m_TileObjectToInstantiateIndex: 65535
      m_AllTileFlags: 1073741825
  - first: {x: 15, y: -3, z: 0}
    second:
      serializedVersion: 2
      m_TileIndex: 61
      m_TileSpriteIndex: 61
      m_TileMatrixIndex: 0
      m_TileColorIndex: 0
      m_TileObjectToInstantiateIndex: 65535
      m_AllTileFlags: 1073741825
  - first: {x: 16, y: -3, z: 0}
    second:
      serializedVersion: 2
      m_TileIndex: 62
      m_TileSpriteIndex: 62
      m_TileMatrixIndex: 0
      m_TileColorIndex: 0
      m_TileObjectToInstantiateIndex: 65535
      m_AllTileFlags: 1073741825
  - first: {x: 17, y: -3, z: 0}
    second:
      serializedVersion: 2
      m_TileIndex: 63
      m_TileSpriteIndex: 63
      m_TileMatrixIndex: 0
      m_TileColorIndex: 0
      m_TileObjectToInstantiateIndex: 65535
      m_AllTileFlags: 1073741825
  - first: {x: -2, y: -2, z: 0}
    second:
      serializedVersion: 2
      m_TileIndex: 40
      m_TileSpriteIndex: 40
      m_TileMatrixIndex: 0
      m_TileColorIndex: 0
      m_TileObjectToInstantiateIndex: 65535
      m_AllTileFlags: 1073741825
  - first: {x: -1, y: -2, z: 0}
    second:
      serializedVersion: 2
      m_TileIndex: 41
      m_TileSpriteIndex: 41
      m_TileMatrixIndex: 0
      m_TileColorIndex: 0
      m_TileObjectToInstantiateIndex: 65535
      m_AllTileFlags: 1073741825
  - first: {x: 0, y: -2, z: 0}
    second:
      serializedVersion: 2
      m_TileIndex: 42
      m_TileSpriteIndex: 42
      m_TileMatrixIndex: 0
      m_TileColorIndex: 0
      m_TileObjectToInstantiateIndex: 65535
      m_AllTileFlags: 1073741825
  - first: {x: 1, y: -2, z: 0}
    second:
      serializedVersion: 2
      m_TileIndex: 43
      m_TileSpriteIndex: 43
      m_TileMatrixIndex: 0
      m_TileColorIndex: 0
      m_TileObjectToInstantiateIndex: 65535
      m_AllTileFlags: 1073741825
  - first: {x: 2, y: -2, z: 0}
    second:
      serializedVersion: 2
      m_TileIndex: 44
      m_TileSpriteIndex: 44
      m_TileMatrixIndex: 0
      m_TileColorIndex: 0
      m_TileObjectToInstantiateIndex: 65535
      m_AllTileFlags: 1073741825
  - first: {x: 3, y: -2, z: 0}
    second:
      serializedVersion: 2
      m_TileIndex: 45
      m_TileSpriteIndex: 45
      m_TileMatrixIndex: 0
      m_TileColorIndex: 0
      m_TileObjectToInstantiateIndex: 65535
      m_AllTileFlags: 1073741825
  - first: {x: 4, y: -2, z: 0}
    second:
      serializedVersion: 2
      m_TileIndex: 46
      m_TileSpriteIndex: 46
      m_TileMatrixIndex: 0
      m_TileColorIndex: 0
      m_TileObjectToInstantiateIndex: 65535
      m_AllTileFlags: 1073741825
  - first: {x: 5, y: -2, z: 0}
    second:
      serializedVersion: 2
      m_TileIndex: 47
      m_TileSpriteIndex: 47
      m_TileMatrixIndex: 0
      m_TileColorIndex: 0
      m_TileObjectToInstantiateIndex: 65535
      m_AllTileFlags: 1073741825
  - first: {x: 6, y: -2, z: 0}
    second:
      serializedVersion: 2
      m_TileIndex: 48
      m_TileSpriteIndex: 48
      m_TileMatrixIndex: 0
      m_TileColorIndex: 0
      m_TileObjectToInstantiateIndex: 65535
      m_AllTileFlags: 1073741825
  - first: {x: 7, y: -2, z: 0}
    second:
      serializedVersion: 2
      m_TileIndex: 49
      m_TileSpriteIndex: 49
      m_TileMatrixIndex: 0
      m_TileColorIndex: 0
      m_TileObjectToInstantiateIndex: 65535
      m_AllTileFlags: 1073741825
  - first: {x: 8, y: -2, z: 0}
    second:
      serializedVersion: 2
      m_TileIndex: 50
      m_TileSpriteIndex: 50
      m_TileMatrixIndex: 0
      m_TileColorIndex: 0
      m_TileObjectToInstantiateIndex: 65535
      m_AllTileFlags: 1073741825
  - first: {x: 12, y: -2, z: 0}
    second:
      serializedVersion: 2
      m_TileIndex: 51
      m_TileSpriteIndex: 51
      m_TileMatrixIndex: 0
      m_TileColorIndex: 0
      m_TileObjectToInstantiateIndex: 65535
      m_AllTileFlags: 1073741825
  - first: {x: 13, y: -2, z: 0}
    second:
      serializedVersion: 2
      m_TileIndex: 52
      m_TileSpriteIndex: 52
      m_TileMatrixIndex: 0
      m_TileColorIndex: 0
      m_TileObjectToInstantiateIndex: 65535
      m_AllTileFlags: 1073741825
  - first: {x: 15, y: -2, z: 0}
    second:
      serializedVersion: 2
      m_TileIndex: 53
      m_TileSpriteIndex: 53
      m_TileMatrixIndex: 0
      m_TileColorIndex: 0
      m_TileObjectToInstantiateIndex: 65535
      m_AllTileFlags: 1073741825
  - first: {x: 16, y: -2, z: 0}
    second:
      serializedVersion: 2
      m_TileIndex: 54
      m_TileSpriteIndex: 54
      m_TileMatrixIndex: 0
      m_TileColorIndex: 0
      m_TileObjectToInstantiateIndex: 65535
      m_AllTileFlags: 1073741825
  - first: {x: -2, y: -1, z: 0}
    second:
      serializedVersion: 2
      m_TileIndex: 29
      m_TileSpriteIndex: 29
      m_TileMatrixIndex: 0
      m_TileColorIndex: 0
      m_TileObjectToInstantiateIndex: 65535
      m_AllTileFlags: 1073741825
  - first: {x: -1, y: -1, z: 0}
    second:
      serializedVersion: 2
      m_TileIndex: 30
      m_TileSpriteIndex: 30
      m_TileMatrixIndex: 0
      m_TileColorIndex: 0
      m_TileObjectToInstantiateIndex: 65535
      m_AllTileFlags: 1073741825
  - first: {x: 0, y: -1, z: 0}
    second:
      serializedVersion: 2
      m_TileIndex: 31
      m_TileSpriteIndex: 31
      m_TileMatrixIndex: 0
      m_TileColorIndex: 0
      m_TileObjectToInstantiateIndex: 65535
      m_AllTileFlags: 1073741825
  - first: {x: 1, y: -1, z: 0}
    second:
      serializedVersion: 2
      m_TileIndex: 32
      m_TileSpriteIndex: 32
      m_TileMatrixIndex: 0
      m_TileColorIndex: 0
      m_TileObjectToInstantiateIndex: 65535
      m_AllTileFlags: 1073741825
  - first: {x: 2, y: -1, z: 0}
    second:
      serializedVersion: 2
      m_TileIndex: 33
      m_TileSpriteIndex: 33
      m_TileMatrixIndex: 0
      m_TileColorIndex: 0
      m_TileObjectToInstantiateIndex: 65535
      m_AllTileFlags: 1073741825
  - first: {x: 3, y: -1, z: 0}
    second:
      serializedVersion: 2
      m_TileIndex: 34
      m_TileSpriteIndex: 34
      m_TileMatrixIndex: 0
      m_TileColorIndex: 0
      m_TileObjectToInstantiateIndex: 65535
      m_AllTileFlags: 1073741825
  - first: {x: 4, y: -1, z: 0}
    second:
      serializedVersion: 2
      m_TileIndex: 35
      m_TileSpriteIndex: 35
      m_TileMatrixIndex: 0
      m_TileColorIndex: 0
      m_TileObjectToInstantiateIndex: 65535
      m_AllTileFlags: 1073741825
  - first: {x: 5, y: -1, z: 0}
    second:
      serializedVersion: 2
      m_TileIndex: 36
      m_TileSpriteIndex: 36
      m_TileMatrixIndex: 0
      m_TileColorIndex: 0
      m_TileObjectToInstantiateIndex: 65535
      m_AllTileFlags: 1073741825
  - first: {x: 6, y: -1, z: 0}
    second:
      serializedVersion: 2
      m_TileIndex: 37
      m_TileSpriteIndex: 37
      m_TileMatrixIndex: 0
      m_TileColorIndex: 0
      m_TileObjectToInstantiateIndex: 65535
      m_AllTileFlags: 1073741825
  - first: {x: 7, y: -1, z: 0}
    second:
      serializedVersion: 2
      m_TileIndex: 38
      m_TileSpriteIndex: 38
      m_TileMatrixIndex: 0
      m_TileColorIndex: 0
      m_TileObjectToInstantiateIndex: 65535
      m_AllTileFlags: 1073741825
  - first: {x: 8, y: -1, z: 0}
    second:
      serializedVersion: 2
      m_TileIndex: 39
      m_TileSpriteIndex: 39
      m_TileMatrixIndex: 0
      m_TileColorIndex: 0
      m_TileObjectToInstantiateIndex: 65535
      m_AllTileFlags: 1073741825
  - first: {x: -2, y: 0, z: 0}
    second:
      serializedVersion: 2
      m_TileIndex: 14
      m_TileSpriteIndex: 14
      m_TileMatrixIndex: 0
      m_TileColorIndex: 0
      m_TileObjectToInstantiateIndex: 65535
      m_AllTileFlags: 1073741825
  - first: {x: -1, y: 0, z: 0}
    second:
      serializedVersion: 2
      m_TileIndex: 15
      m_TileSpriteIndex: 15
      m_TileMatrixIndex: 0
      m_TileColorIndex: 0
      m_TileObjectToInstantiateIndex: 65535
      m_AllTileFlags: 1073741825
  - first: {x: 0, y: 0, z: 0}
    second:
      serializedVersion: 2
      m_TileIndex: 16
      m_TileSpriteIndex: 16
      m_TileMatrixIndex: 0
      m_TileColorIndex: 0
      m_TileObjectToInstantiateIndex: 65535
      m_AllTileFlags: 1073741825
  - first: {x: 1, y: 0, z: 0}
    second:
      serializedVersion: 2
      m_TileIndex: 17
      m_TileSpriteIndex: 17
      m_TileMatrixIndex: 0
      m_TileColorIndex: 0
      m_TileObjectToInstantiateIndex: 65535
      m_AllTileFlags: 1073741825
  - first: {x: 2, y: 0, z: 0}
    second:
      serializedVersion: 2
      m_TileIndex: 18
      m_TileSpriteIndex: 18
      m_TileMatrixIndex: 0
      m_TileColorIndex: 0
      m_TileObjectToInstantiateIndex: 65535
      m_AllTileFlags: 1073741825
  - first: {x: 3, y: 0, z: 0}
    second:
      serializedVersion: 2
      m_TileIndex: 19
      m_TileSpriteIndex: 19
      m_TileMatrixIndex: 0
      m_TileColorIndex: 0
      m_TileObjectToInstantiateIndex: 65535
      m_AllTileFlags: 1073741825
  - first: {x: 4, y: 0, z: 0}
    second:
      serializedVersion: 2
      m_TileIndex: 20
      m_TileSpriteIndex: 20
      m_TileMatrixIndex: 0
      m_TileColorIndex: 0
      m_TileObjectToInstantiateIndex: 65535
      m_AllTileFlags: 1073741825
  - first: {x: 5, y: 0, z: 0}
    second:
      serializedVersion: 2
      m_TileIndex: 21
      m_TileSpriteIndex: 21
      m_TileMatrixIndex: 0
      m_TileColorIndex: 0
      m_TileObjectToInstantiateIndex: 65535
      m_AllTileFlags: 1073741825
  - first: {x: 6, y: 0, z: 0}
    second:
      serializedVersion: 2
      m_TileIndex: 22
      m_TileSpriteIndex: 22
      m_TileMatrixIndex: 0
      m_TileColorIndex: 0
      m_TileObjectToInstantiateIndex: 65535
      m_AllTileFlags: 1073741825
  - first: {x: 7, y: 0, z: 0}
    second:
      serializedVersion: 2
      m_TileIndex: 23
      m_TileSpriteIndex: 23
      m_TileMatrixIndex: 0
      m_TileColorIndex: 0
      m_TileObjectToInstantiateIndex: 65535
      m_AllTileFlags: 1073741825
  - first: {x: 10, y: 0, z: 0}
    second:
      serializedVersion: 2
      m_TileIndex: 24
      m_TileSpriteIndex: 24
      m_TileMatrixIndex: 0
      m_TileColorIndex: 0
      m_TileObjectToInstantiateIndex: 65535
      m_AllTileFlags: 1073741825
  - first: {x: 12, y: 0, z: 0}
    second:
      serializedVersion: 2
      m_TileIndex: 25
      m_TileSpriteIndex: 25
      m_TileMatrixIndex: 0
      m_TileColorIndex: 0
      m_TileObjectToInstantiateIndex: 65535
      m_AllTileFlags: 1073741825
  - first: {x: 15, y: 0, z: 0}
    second:
      serializedVersion: 2
      m_TileIndex: 26
      m_TileSpriteIndex: 26
      m_TileMatrixIndex: 0
      m_TileColorIndex: 0
      m_TileObjectToInstantiateIndex: 65535
      m_AllTileFlags: 1073741825
  - first: {x: 16, y: 0, z: 0}
    second:
      serializedVersion: 2
      m_TileIndex: 27
      m_TileSpriteIndex: 27
      m_TileMatrixIndex: 0
      m_TileColorIndex: 0
      m_TileObjectToInstantiateIndex: 65535
      m_AllTileFlags: 1073741825
  - first: {x: 17, y: 0, z: 0}
    second:
      serializedVersion: 2
      m_TileIndex: 28
      m_TileSpriteIndex: 28
      m_TileMatrixIndex: 0
      m_TileColorIndex: 0
      m_TileObjectToInstantiateIndex: 65535
      m_AllTileFlags: 1073741825
  - first: {x: -2, y: 1, z: 0}
    second:
      serializedVersion: 2
      m_TileIndex: 1
      m_TileSpriteIndex: 1
      m_TileMatrixIndex: 0
      m_TileColorIndex: 0
      m_TileObjectToInstantiateIndex: 65535
      m_AllTileFlags: 1073741825
  - first: {x: -1, y: 1, z: 0}
    second:
      serializedVersion: 2
      m_TileIndex: 2
      m_TileSpriteIndex: 2
      m_TileMatrixIndex: 0
      m_TileColorIndex: 0
      m_TileObjectToInstantiateIndex: 65535
      m_AllTileFlags: 1073741825
  - first: {x: 0, y: 1, z: 0}
    second:
      serializedVersion: 2
      m_TileIndex: 3
      m_TileSpriteIndex: 3
      m_TileMatrixIndex: 0
      m_TileColorIndex: 0
      m_TileObjectToInstantiateIndex: 65535
      m_AllTileFlags: 1073741825
  - first: {x: 1, y: 1, z: 0}
    second:
      serializedVersion: 2
      m_TileIndex: 4
      m_TileSpriteIndex: 4
      m_TileMatrixIndex: 0
      m_TileColorIndex: 0
      m_TileObjectToInstantiateIndex: 65535
      m_AllTileFlags: 1073741825
  - first: {x: 2, y: 1, z: 0}
    second:
      serializedVersion: 2
      m_TileIndex: 5
      m_TileSpriteIndex: 5
      m_TileMatrixIndex: 0
      m_TileColorIndex: 0
      m_TileObjectToInstantiateIndex: 65535
      m_AllTileFlags: 1073741825
  - first: {x: 3, y: 1, z: 0}
    second:
      serializedVersion: 2
      m_TileIndex: 6
      m_TileSpriteIndex: 6
      m_TileMatrixIndex: 0
      m_TileColorIndex: 0
      m_TileObjectToInstantiateIndex: 65535
      m_AllTileFlags: 1073741825
  - first: {x: 4, y: 1, z: 0}
    second:
      serializedVersion: 2
      m_TileIndex: 7
      m_TileSpriteIndex: 7
      m_TileMatrixIndex: 0
      m_TileColorIndex: 0
      m_TileObjectToInstantiateIndex: 65535
      m_AllTileFlags: 1073741825
  - first: {x: 5, y: 1, z: 0}
    second:
      serializedVersion: 2
      m_TileIndex: 8
      m_TileSpriteIndex: 8
      m_TileMatrixIndex: 0
      m_TileColorIndex: 0
      m_TileObjectToInstantiateIndex: 65535
      m_AllTileFlags: 1073741825
  - first: {x: 6, y: 1, z: 0}
    second:
      serializedVersion: 2
      m_TileIndex: 9
      m_TileSpriteIndex: 9
      m_TileMatrixIndex: 0
      m_TileColorIndex: 0
      m_TileObjectToInstantiateIndex: 65535
      m_AllTileFlags: 1073741825
  - first: {x: 7, y: 1, z: 0}
    second:
      serializedVersion: 2
      m_TileIndex: 10
      m_TileSpriteIndex: 10
      m_TileMatrixIndex: 0
      m_TileColorIndex: 0
      m_TileObjectToInstantiateIndex: 65535
      m_AllTileFlags: 1073741825
  - first: {x: 12, y: 1, z: 0}
    second:
      serializedVersion: 2
      m_TileIndex: 11
      m_TileSpriteIndex: 11
      m_TileMatrixIndex: 0
      m_TileColorIndex: 0
      m_TileObjectToInstantiateIndex: 65535
      m_AllTileFlags: 1073741825
  - first: {x: 18, y: 1, z: 0}
    second:
      serializedVersion: 2
      m_TileIndex: 12
      m_TileSpriteIndex: 12
      m_TileMatrixIndex: 0
      m_TileColorIndex: 0
      m_TileObjectToInstantiateIndex: 65535
      m_AllTileFlags: 1073741825
  - first: {x: 19, y: 1, z: 0}
    second:
      serializedVersion: 2
      m_TileIndex: 13
      m_TileSpriteIndex: 13
      m_TileMatrixIndex: 0
      m_TileColorIndex: 0
      m_TileObjectToInstantiateIndex: 65535
      m_AllTileFlags: 1073741825
  - first: {x: 18, y: 2, z: 0}
    second:
      serializedVersion: 2
      m_TileIndex: 0
      m_TileSpriteIndex: 0
      m_TileMatrixIndex: 0
      m_TileColorIndex: 0
      m_TileObjectToInstantiateIndex: 65535
      m_AllTileFlags: 1073741825
  m_AnimatedTiles: {}
  m_TileAssetArray:
  - m_RefCount: 1
    m_Data: {fileID: 11400000, guid: 700c3080472b55341b15bf255315379d, type: 2}
  - m_RefCount: 1
    m_Data: {fileID: 11400000, guid: 6641559aca76bb0478e7beee295e9b4b, type: 2}
  - m_RefCount: 1
    m_Data: {fileID: 11400000, guid: 585de536c3775af47863c01c9809658d, type: 2}
  - m_RefCount: 1
    m_Data: {fileID: 11400000, guid: 0f9eeb9ff8f52004ca0738bd296dcdf3, type: 2}
  - m_RefCount: 1
    m_Data: {fileID: 11400000, guid: 87cfecdb7860f3f4bb84a338457dc588, type: 2}
  - m_RefCount: 1
    m_Data: {fileID: 11400000, guid: b4ea58d421549a442a06e3c23348d088, type: 2}
  - m_RefCount: 1
    m_Data: {fileID: 11400000, guid: 32c0a5cdb71e5f949995706e5e166156, type: 2}
  - m_RefCount: 1
    m_Data: {fileID: 11400000, guid: 1ca526bb084591142924012cef743f4e, type: 2}
  - m_RefCount: 1
    m_Data: {fileID: 11400000, guid: f45a3375c888ccc4ab8e55a4cc21fa3e, type: 2}
  - m_RefCount: 1
    m_Data: {fileID: 11400000, guid: 75bf38fa01d5d54478d388874f700e91, type: 2}
  - m_RefCount: 1
    m_Data: {fileID: 11400000, guid: d1cbf4ae2882ec84b83b804866c59c34, type: 2}
  - m_RefCount: 1
    m_Data: {fileID: 11400000, guid: 6b8ecf3f0a19dbc4fbbc456b0bdfec03, type: 2}
  - m_RefCount: 1
    m_Data: {fileID: 11400000, guid: 19228875926e6ce4e9543fab3fa282ef, type: 2}
  - m_RefCount: 1
    m_Data: {fileID: 11400000, guid: bbe89e99bfc646c4c95cf5a25059382c, type: 2}
  - m_RefCount: 1
    m_Data: {fileID: 11400000, guid: 049f4bd6a054f464ba1597b77ba76134, type: 2}
  - m_RefCount: 1
    m_Data: {fileID: 11400000, guid: f63fa83344deb0d41936d4db5453c7af, type: 2}
  - m_RefCount: 1
    m_Data: {fileID: 11400000, guid: 2a7599c8cf234f24dab6c6eebcc907c7, type: 2}
  - m_RefCount: 1
    m_Data: {fileID: 11400000, guid: cb7024e3bb8c8724f8985fd28a2c6262, type: 2}
  - m_RefCount: 1
    m_Data: {fileID: 11400000, guid: 2f980ee608409ab41abd1f78910572ed, type: 2}
  - m_RefCount: 1
    m_Data: {fileID: 11400000, guid: 9e5058255fde12149812ec25bea546ab, type: 2}
  - m_RefCount: 1
    m_Data: {fileID: 11400000, guid: e84a33d618f5a194085a71faab7dfe82, type: 2}
  - m_RefCount: 1
    m_Data: {fileID: 11400000, guid: 743c35524721c8e449db2582fc9f123c, type: 2}
  - m_RefCount: 1
    m_Data: {fileID: 11400000, guid: 38680bbbe95c866469464f7a42d03597, type: 2}
  - m_RefCount: 1
    m_Data: {fileID: 11400000, guid: 5e4095cf0d288f944b6cab30c7c30640, type: 2}
  - m_RefCount: 1
    m_Data: {fileID: 11400000, guid: 5f5bad0720dedca4594e49fb74558f98, type: 2}
  - m_RefCount: 1
    m_Data: {fileID: 11400000, guid: 2a587dfe70cddba4482432601c067ee6, type: 2}
  - m_RefCount: 1
    m_Data: {fileID: 11400000, guid: 39c066fcf954bed47884e5654e01f2c2, type: 2}
  - m_RefCount: 1
    m_Data: {fileID: 11400000, guid: dc57b6d8531ade24782dec6edc8bf548, type: 2}
  - m_RefCount: 1
    m_Data: {fileID: 11400000, guid: 088cb7fc59dda704a94c7eaf77792bf9, type: 2}
  - m_RefCount: 1
    m_Data: {fileID: 11400000, guid: 57ac6e65b4d1d3548bc8cd3d0cd40af5, type: 2}
  - m_RefCount: 1
    m_Data: {fileID: 11400000, guid: 172704ed82bbb7647b58c7d3854902ce, type: 2}
  - m_RefCount: 1
    m_Data: {fileID: 11400000, guid: 0316c34085fd7a747ae09296333e08b1, type: 2}
  - m_RefCount: 1
    m_Data: {fileID: 11400000, guid: b6a7769c693535144be8cef00d97f050, type: 2}
  - m_RefCount: 1
    m_Data: {fileID: 11400000, guid: 39904a987f20dd645a239bd102743b4a, type: 2}
  - m_RefCount: 1
    m_Data: {fileID: 11400000, guid: d85fae322f893ed4dbe7c064985622a0, type: 2}
  - m_RefCount: 1
    m_Data: {fileID: 11400000, guid: a987611f581b09c48a27f29d5f853909, type: 2}
  - m_RefCount: 1
    m_Data: {fileID: 11400000, guid: 6d647aba73b294e4caec933dc6def542, type: 2}
  - m_RefCount: 1
    m_Data: {fileID: 11400000, guid: 6cb36b9a95fe5cd46b9e83e4eba4239d, type: 2}
  - m_RefCount: 1
    m_Data: {fileID: 11400000, guid: f6a97f90103054b498af190479c76f26, type: 2}
  - m_RefCount: 1
    m_Data: {fileID: 11400000, guid: db299f0cfab46124a96618431858a753, type: 2}
  - m_RefCount: 1
    m_Data: {fileID: 11400000, guid: 7536aa8b203f72e4e82dab0b5da27ad4, type: 2}
  - m_RefCount: 1
    m_Data: {fileID: 11400000, guid: bfb51bb5a4ed69b4f877ba43eacd8a34, type: 2}
  - m_RefCount: 1
    m_Data: {fileID: 11400000, guid: aa7c4b1a33c884042a817482d2c57cbd, type: 2}
  - m_RefCount: 1
    m_Data: {fileID: 11400000, guid: f7a6c33987c27b7419f54fe15dde810d, type: 2}
  - m_RefCount: 1
    m_Data: {fileID: 11400000, guid: dc1a207041d8a52439ccaf81b787cfe2, type: 2}
  - m_RefCount: 1
    m_Data: {fileID: 11400000, guid: 7fee98a8f1eab29489a39ff6c196e6c6, type: 2}
  - m_RefCount: 1
    m_Data: {fileID: 11400000, guid: b41b6cc1f5f19b044834be54229d9fa7, type: 2}
  - m_RefCount: 1
    m_Data: {fileID: 11400000, guid: 7b185f88abb67134daeb7c20e44cf0a6, type: 2}
  - m_RefCount: 1
    m_Data: {fileID: 11400000, guid: 2b4b048fd0abb1a419a3bd85b57f3a43, type: 2}
  - m_RefCount: 1
    m_Data: {fileID: 11400000, guid: 83ce3155c202f1847a1cc53139c1f6a3, type: 2}
  - m_RefCount: 1
    m_Data: {fileID: 11400000, guid: e8a2fbb72cb9d57469a86260261f3a29, type: 2}
  - m_RefCount: 1
    m_Data: {fileID: 11400000, guid: e24b1eb12d6b0b041992aa499743ba38, type: 2}
  - m_RefCount: 1
    m_Data: {fileID: 11400000, guid: 698495502b53df643a4b9c354aac63a6, type: 2}
  - m_RefCount: 1
    m_Data: {fileID: 11400000, guid: 8b9c990fdcdf7a347ad5be6a30799cc2, type: 2}
  - m_RefCount: 1
    m_Data: {fileID: 11400000, guid: 60ad3a77827d56542819a8d9cd1259a6, type: 2}
  - m_RefCount: 1
    m_Data: {fileID: 11400000, guid: 9c13cfdb7c1e3a349b36bb8a89bbc909, type: 2}
  - m_RefCount: 1
    m_Data: {fileID: 11400000, guid: 7d281d65894d43045b38a1bc26e322ab, type: 2}
  - m_RefCount: 1
    m_Data: {fileID: 11400000, guid: 2bbbef71e713dd349aeaf2498fdaa7c5, type: 2}
  - m_RefCount: 1
    m_Data: {fileID: 11400000, guid: 72c4475cf30413f4f9b493fbc5c8a679, type: 2}
  - m_RefCount: 1
    m_Data: {fileID: 11400000, guid: d72e6739a51322a41917813aabbee4fe, type: 2}
  - m_RefCount: 1
    m_Data: {fileID: 11400000, guid: a4eee88fead0a3a45aafa41122d87a79, type: 2}
  - m_RefCount: 1
    m_Data: {fileID: 11400000, guid: f28937bb204f6e243ab97e172604b047, type: 2}
  - m_RefCount: 1
    m_Data: {fileID: 11400000, guid: 5fd7d11aa02a4354d9d01b4dc4bf0a76, type: 2}
  - m_RefCount: 1
    m_Data: {fileID: 11400000, guid: a3e2191b98da6e4478e375db5cb44255, type: 2}
  - m_RefCount: 1
    m_Data: {fileID: 11400000, guid: 0b771958161c86547a1ae0635b6a884c, type: 2}
  - m_RefCount: 1
    m_Data: {fileID: 11400000, guid: b925d127b60328d4896d6ba1e6254d4a, type: 2}
  - m_RefCount: 1
    m_Data: {fileID: 11400000, guid: 9e5e888b6814bb94f9610d4ada562933, type: 2}
  - m_RefCount: 1
    m_Data: {fileID: 11400000, guid: e1f62af241d218b4e97c45aaf831587c, type: 2}
  - m_RefCount: 1
    m_Data: {fileID: 11400000, guid: f773083d9fd078e48801d980d1ec9f46, type: 2}
  - m_RefCount: 1
    m_Data: {fileID: 11400000, guid: 3fb2b2b053afa484cba839c55be102b8, type: 2}
  - m_RefCount: 1
    m_Data: {fileID: 11400000, guid: 50e203f245106ec4a8e5f584740cdddd, type: 2}
  - m_RefCount: 1
    m_Data: {fileID: 11400000, guid: f5e3d02d178cc064e8b9e17d1217202b, type: 2}
  - m_RefCount: 1
    m_Data: {fileID: 11400000, guid: db5be21c7e51d6840b82af305f6845f7, type: 2}
  - m_RefCount: 1
    m_Data: {fileID: 11400000, guid: 6d1cde2796729794cbb63869168fdc31, type: 2}
  - m_RefCount: 1
    m_Data: {fileID: 11400000, guid: 50effcd1bb9f5e140b9d080548a30836, type: 2}
  - m_RefCount: 1
    m_Data: {fileID: 11400000, guid: 34837c79c0066a84e89a6466ebe8ef16, type: 2}
  - m_RefCount: 1
    m_Data: {fileID: 11400000, guid: cefc59e2eaffac740a567faf0a56e074, type: 2}
  - m_RefCount: 1
    m_Data: {fileID: 11400000, guid: fbda62cb7352ea34798fc02e6ae28d4b, type: 2}
  - m_RefCount: 1
    m_Data: {fileID: 11400000, guid: a6553f9861393ca4d984a9e201db051b, type: 2}
  - m_RefCount: 1
    m_Data: {fileID: 11400000, guid: 6e8f3d385b7d94047ba5f5028d4bb7b9, type: 2}
  - m_RefCount: 1
    m_Data: {fileID: 11400000, guid: 9d60cb4c20256b04f8aa4d27125efee1, type: 2}
  - m_RefCount: 1
    m_Data: {fileID: 11400000, guid: be993c86a0fd2d841bdabe4facab34ea, type: 2}
  - m_RefCount: 1
    m_Data: {fileID: 11400000, guid: 9134cd04d9e567248ae23e9ee3c3ef49, type: 2}
  - m_RefCount: 1
    m_Data: {fileID: 11400000, guid: 9e7fa84cf2b86a444ae417ffebcf5e42, type: 2}
  - m_RefCount: 1
    m_Data: {fileID: 11400000, guid: 75e6b98e7f2e7d54cab970af8cfe053a, type: 2}
  - m_RefCount: 1
    m_Data: {fileID: 11400000, guid: 06b160cdfff8a154d8ea329e6af4479d, type: 2}
  - m_RefCount: 1
    m_Data: {fileID: 11400000, guid: 040daf0563d4dbe49b78afba50ff38e2, type: 2}
  - m_RefCount: 1
    m_Data: {fileID: 11400000, guid: 0003353dc7ef39647acfa6c1c2524c7f, type: 2}
  - m_RefCount: 1
    m_Data: {fileID: 11400000, guid: 5bb89d5e27011434ba0b805e7905cd1e, type: 2}
  - m_RefCount: 1
    m_Data: {fileID: 11400000, guid: 4f291c73ab2ee5c4d83e193e0c200379, type: 2}
  - m_RefCount: 1
    m_Data: {fileID: 11400000, guid: ca4be7dcbf03c0a43a8dda603a660240, type: 2}
  - m_RefCount: 1
    m_Data: {fileID: 11400000, guid: 525666392b456f3448dc6aeb5c9f9856, type: 2}
  - m_RefCount: 1
    m_Data: {fileID: 11400000, guid: 0f1179f01755fb04987e34700adf51f5, type: 2}
  - m_RefCount: 1
    m_Data: {fileID: 11400000, guid: d1f00a8a23f916d49a96f4f739edc722, type: 2}
  - m_RefCount: 1
    m_Data: {fileID: 11400000, guid: 4065136d90ecfb54597a3e2edc0fba24, type: 2}
  - m_RefCount: 1
    m_Data: {fileID: 11400000, guid: e13dbdc088fe1cf4eb5049d34148a14b, type: 2}
  - m_RefCount: 1
    m_Data: {fileID: 11400000, guid: 79b3d38fed7ecca49804ef550075672e, type: 2}
  - m_RefCount: 1
    m_Data: {fileID: 11400000, guid: aa3e6fe56913031458527440574f1198, type: 2}
  - m_RefCount: 1
    m_Data: {fileID: 11400000, guid: 26f3e4d9e2e923545bbd87838fbc131d, type: 2}
  - m_RefCount: 1
    m_Data: {fileID: 11400000, guid: 783a2a0a25d1fbf4c8da2e85cdda54ed, type: 2}
  - m_RefCount: 1
    m_Data: {fileID: 11400000, guid: b81131aac4aecf649923a361c458c8b4, type: 2}
  - m_RefCount: 1
    m_Data: {fileID: 11400000, guid: 82584774b1822f843b7384eee84abfd9, type: 2}
  - m_RefCount: 1
    m_Data: {fileID: 11400000, guid: 43e0974bb6c929942a637f0e004c5fe7, type: 2}
  - m_RefCount: 1
    m_Data: {fileID: 11400000, guid: 051caefd9b48690488ddb00da284a799, type: 2}
  - m_RefCount: 1
    m_Data: {fileID: 11400000, guid: 72d218b965f3c7544a2f2ba28dd766ee, type: 2}
  - m_RefCount: 1
    m_Data: {fileID: 11400000, guid: 62f8f29783e0f4c4fab202feb7674c17, type: 2}
  - m_RefCount: 1
    m_Data: {fileID: 11400000, guid: 704fd762d54f8184eae8fcff0c3aecef, type: 2}
  - m_RefCount: 1
    m_Data: {fileID: 11400000, guid: 81ce03ad994893b4ea87004429873ab9, type: 2}
  - m_RefCount: 1
    m_Data: {fileID: 11400000, guid: 42018914f689d4c4fa21855ecbd143c7, type: 2}
  - m_RefCount: 1
    m_Data: {fileID: 11400000, guid: 3d67fb8e5f9c1b24389fcda2377ac6d7, type: 2}
  - m_RefCount: 1
    m_Data: {fileID: 11400000, guid: 083ec2eaa1c71474596e36ee277c6fc1, type: 2}
  - m_RefCount: 1
    m_Data: {fileID: 11400000, guid: 717f4b2869920f543b5f53bb0c9286a2, type: 2}
  - m_RefCount: 1
    m_Data: {fileID: 11400000, guid: 19a6c8d0081d1df48b56ab4ce67b3937, type: 2}
  - m_RefCount: 1
    m_Data: {fileID: 11400000, guid: a13b097f2cb6b92458b8afebb5c773a8, type: 2}
  - m_RefCount: 1
    m_Data: {fileID: 11400000, guid: 222aabb1d98eef74783d140e041e749a, type: 2}
  - m_RefCount: 1
    m_Data: {fileID: 11400000, guid: 1394715d4a6e69a4abad5bfdc579337e, type: 2}
  - m_RefCount: 1
    m_Data: {fileID: 11400000, guid: 7810f5979c2645443a107d624dd4b447, type: 2}
  - m_RefCount: 1
    m_Data: {fileID: 11400000, guid: 5447f7815a915c947add05fe4d575353, type: 2}
  - m_RefCount: 1
    m_Data: {fileID: 11400000, guid: cb50817fa67dbfa429be17c2fddfc404, type: 2}
  - m_RefCount: 1
    m_Data: {fileID: 11400000, guid: 9ada31586981d214fa0a2b956e5e3668, type: 2}
  - m_RefCount: 1
    m_Data: {fileID: 11400000, guid: 823e756ec790c37439b919ad3761dff0, type: 2}
  - m_RefCount: 1
    m_Data: {fileID: 11400000, guid: a4874e73ed87188468462650fd107999, type: 2}
  - m_RefCount: 1
    m_Data: {fileID: 11400000, guid: 9e8531c080fb57f488fae91a9b6261c6, type: 2}
  - m_RefCount: 1
    m_Data: {fileID: 11400000, guid: 500c5368080129542b7c054b22fdfcf4, type: 2}
  - m_RefCount: 1
    m_Data: {fileID: 11400000, guid: 1989468b89dac784b90861b470cd9ee9, type: 2}
  - m_RefCount: 1
    m_Data: {fileID: 11400000, guid: 5938cd3148b84b143a9486f37e819bf5, type: 2}
  - m_RefCount: 1
    m_Data: {fileID: 11400000, guid: 371641247551f234fbf70c054f17b43e, type: 2}
  - m_RefCount: 1
    m_Data: {fileID: 11400000, guid: 8fdefcf374474214fbf9d60d0239ecc3, type: 2}
  - m_RefCount: 1
    m_Data: {fileID: 11400000, guid: da3206cf25a768044b293e2dd77337ad, type: 2}
  - m_RefCount: 1
    m_Data: {fileID: 11400000, guid: 84cc5a20f861afd44bffad4325a8c285, type: 2}
  - m_RefCount: 1
    m_Data: {fileID: 11400000, guid: 26738398eca3af84b970232ea14533ec, type: 2}
  - m_RefCount: 1
    m_Data: {fileID: 11400000, guid: 15ad6004d73f6f14bbe4e85132b17cbc, type: 2}
  - m_RefCount: 1
    m_Data: {fileID: 11400000, guid: c15a902098e18a54386e70c011f0dd70, type: 2}
  - m_RefCount: 1
    m_Data: {fileID: 11400000, guid: 07f1954f3cce77340a175f4f70752288, type: 2}
  - m_RefCount: 1
    m_Data: {fileID: 11400000, guid: cc9c0b817070d9d4989874dfa2d3768f, type: 2}
  - m_RefCount: 1
    m_Data: {fileID: 11400000, guid: 0f6b142447483a7409cd0e3e30a54f64, type: 2}
  - m_RefCount: 1
    m_Data: {fileID: 11400000, guid: 3c84d13b97d200342bc7849e5de71545, type: 2}
  - m_RefCount: 1
    m_Data: {fileID: 11400000, guid: 2ae45124e8690d24e9dcfa2967f2c862, type: 2}
  - m_RefCount: 1
    m_Data: {fileID: 11400000, guid: 5142720cd7e33494a8fd08e684f17646, type: 2}
  - m_RefCount: 1
    m_Data: {fileID: 11400000, guid: 7d5456a98fca20148a5d732faebcb8f8, type: 2}
  - m_RefCount: 1
    m_Data: {fileID: 11400000, guid: 357b2fb4ea80634438f06c82ecc894fc, type: 2}
  - m_RefCount: 1
    m_Data: {fileID: 11400000, guid: 10db87afe2398a147883b1007d81a55a, type: 2}
  - m_RefCount: 1
    m_Data: {fileID: 11400000, guid: ca3b5dd24e9f40c498066ae9ca75df0a, type: 2}
  - m_RefCount: 1
    m_Data: {fileID: 11400000, guid: 091c035cfcbd4c6488d3900844e8b658, type: 2}
  - m_RefCount: 1
    m_Data: {fileID: 11400000, guid: bc2d1b7ab9e1ef24aaccdfa3eb775bb4, type: 2}
  - m_RefCount: 1
    m_Data: {fileID: 11400000, guid: e5627028959562042aaa870a203434e9, type: 2}
  - m_RefCount: 1
    m_Data: {fileID: 11400000, guid: 34b2778e8d2d1cc478d8c8d6fccdcc05, type: 2}
  - m_RefCount: 1
    m_Data: {fileID: 11400000, guid: bf49943e26c0ba943b0ac120248a60b6, type: 2}
  - m_RefCount: 1
    m_Data: {fileID: 11400000, guid: a3db1dc801043264fb7cc33d93f5f526, type: 2}
  - m_RefCount: 1
    m_Data: {fileID: 11400000, guid: 56f523036d2f2af4dae0884c731f2e51, type: 2}
  - m_RefCount: 1
    m_Data: {fileID: 11400000, guid: 7711cfcb2223f0e44886da0448c3d511, type: 2}
  - m_RefCount: 1
    m_Data: {fileID: 11400000, guid: d1904e7ecdf273149bc317450fcf6134, type: 2}
  - m_RefCount: 1
    m_Data: {fileID: 11400000, guid: 164645e6e0546704aa8ed6155ebdee79, type: 2}
  - m_RefCount: 1
    m_Data: {fileID: 11400000, guid: f96160ea60c6b4b4eb6b5dad7cbab46c, type: 2}
  - m_RefCount: 1
    m_Data: {fileID: 11400000, guid: 2c6d77c42f9c052488e16ac2b354d72f, type: 2}
  - m_RefCount: 1
    m_Data: {fileID: 11400000, guid: d7b6cc55fe6dddf48bb9f29ec45307a0, type: 2}
  m_TileSpriteArray:
  - m_RefCount: 1
    m_Data: {fileID: 328927695098546588, guid: b37f98ccd76addb45aa05f91865b6073, type: 3}
  - m_RefCount: 1
    m_Data: {fileID: 1011971064945998710, guid: b37f98ccd76addb45aa05f91865b6073,
      type: 3}
  - m_RefCount: 1
    m_Data: {fileID: 2069236468862401506, guid: b37f98ccd76addb45aa05f91865b6073,
      type: 3}
  - m_RefCount: 1
    m_Data: {fileID: -6541409448519260176, guid: b37f98ccd76addb45aa05f91865b6073,
      type: 3}
  - m_RefCount: 1
    m_Data: {fileID: 8223230976836880944, guid: b37f98ccd76addb45aa05f91865b6073,
      type: 3}
  - m_RefCount: 1
    m_Data: {fileID: -6859332746630046634, guid: b37f98ccd76addb45aa05f91865b6073,
      type: 3}
  - m_RefCount: 1
    m_Data: {fileID: -6228266668396571484, guid: b37f98ccd76addb45aa05f91865b6073,
      type: 3}
  - m_RefCount: 1
    m_Data: {fileID: 287695748469693560, guid: b37f98ccd76addb45aa05f91865b6073, type: 3}
  - m_RefCount: 1
    m_Data: {fileID: 2748639973423595309, guid: b37f98ccd76addb45aa05f91865b6073,
      type: 3}
  - m_RefCount: 1
    m_Data: {fileID: -7517102711130658523, guid: b37f98ccd76addb45aa05f91865b6073,
      type: 3}
  - m_RefCount: 1
    m_Data: {fileID: 6308416370126617957, guid: b37f98ccd76addb45aa05f91865b6073,
      type: 3}
  - m_RefCount: 1
    m_Data: {fileID: -6593434994063281373, guid: b37f98ccd76addb45aa05f91865b6073,
      type: 3}
  - m_RefCount: 1
    m_Data: {fileID: 5504268498787665186, guid: b37f98ccd76addb45aa05f91865b6073,
      type: 3}
  - m_RefCount: 1
    m_Data: {fileID: 8763687438945348627, guid: b37f98ccd76addb45aa05f91865b6073,
      type: 3}
  - m_RefCount: 1
    m_Data: {fileID: -9126717685207223361, guid: b37f98ccd76addb45aa05f91865b6073,
      type: 3}
  - m_RefCount: 1
    m_Data: {fileID: 5655798556028094613, guid: b37f98ccd76addb45aa05f91865b6073,
      type: 3}
  - m_RefCount: 1
    m_Data: {fileID: -1865555867103814710, guid: b37f98ccd76addb45aa05f91865b6073,
      type: 3}
  - m_RefCount: 1
    m_Data: {fileID: -1318307820673767783, guid: b37f98ccd76addb45aa05f91865b6073,
      type: 3}
  - m_RefCount: 1
    m_Data: {fileID: 5157699855294565198, guid: b37f98ccd76addb45aa05f91865b6073,
      type: 3}
  - m_RefCount: 1
    m_Data: {fileID: -1089724831394402596, guid: b37f98ccd76addb45aa05f91865b6073,
      type: 3}
  - m_RefCount: 1
    m_Data: {fileID: 1076306598005878171, guid: b37f98ccd76addb45aa05f91865b6073,
      type: 3}
  - m_RefCount: 1
    m_Data: {fileID: -5800435480312555656, guid: b37f98ccd76addb45aa05f91865b6073,
      type: 3}
  - m_RefCount: 1
    m_Data: {fileID: 4609081988145285668, guid: b37f98ccd76addb45aa05f91865b6073,
      type: 3}
  - m_RefCount: 1
    m_Data: {fileID: 41817754376110403, guid: b37f98ccd76addb45aa05f91865b6073, type: 3}
  - m_RefCount: 1
    m_Data: {fileID: 7330884861252074068, guid: b37f98ccd76addb45aa05f91865b6073,
      type: 3}
  - m_RefCount: 1
    m_Data: {fileID: -4078621663465182273, guid: b37f98ccd76addb45aa05f91865b6073,
      type: 3}
  - m_RefCount: 1
    m_Data: {fileID: 7308199581243885356, guid: b37f98ccd76addb45aa05f91865b6073,
      type: 3}
  - m_RefCount: 1
    m_Data: {fileID: 2529436739235500109, guid: b37f98ccd76addb45aa05f91865b6073,
      type: 3}
  - m_RefCount: 1
    m_Data: {fileID: -8320671507095019202, guid: b37f98ccd76addb45aa05f91865b6073,
      type: 3}
  - m_RefCount: 1
    m_Data: {fileID: 2310634759727228763, guid: b37f98ccd76addb45aa05f91865b6073,
      type: 3}
  - m_RefCount: 1
    m_Data: {fileID: -2411887978837833606, guid: b37f98ccd76addb45aa05f91865b6073,
      type: 3}
  - m_RefCount: 1
    m_Data: {fileID: -8316720704844790015, guid: b37f98ccd76addb45aa05f91865b6073,
      type: 3}
  - m_RefCount: 1
    m_Data: {fileID: 2366359667042775335, guid: b37f98ccd76addb45aa05f91865b6073,
      type: 3}
  - m_RefCount: 1
    m_Data: {fileID: 8559970082657703204, guid: b37f98ccd76addb45aa05f91865b6073,
      type: 3}
  - m_RefCount: 1
    m_Data: {fileID: -4225815222105925157, guid: b37f98ccd76addb45aa05f91865b6073,
      type: 3}
  - m_RefCount: 1
    m_Data: {fileID: -6372965367978767026, guid: b37f98ccd76addb45aa05f91865b6073,
      type: 3}
  - m_RefCount: 1
    m_Data: {fileID: -3276682429080897233, guid: b37f98ccd76addb45aa05f91865b6073,
      type: 3}
  - m_RefCount: 1
    m_Data: {fileID: 3494101573565998025, guid: b37f98ccd76addb45aa05f91865b6073,
      type: 3}
  - m_RefCount: 1
    m_Data: {fileID: -920784207713569564, guid: b37f98ccd76addb45aa05f91865b6073,
      type: 3}
  - m_RefCount: 1
    m_Data: {fileID: -701847872664018538, guid: b37f98ccd76addb45aa05f91865b6073,
      type: 3}
  - m_RefCount: 1
    m_Data: {fileID: -437979809179832502, guid: b37f98ccd76addb45aa05f91865b6073,
      type: 3}
  - m_RefCount: 1
    m_Data: {fileID: -2527091687228386148, guid: b37f98ccd76addb45aa05f91865b6073,
      type: 3}
  - m_RefCount: 1
    m_Data: {fileID: -2022240510435885989, guid: b37f98ccd76addb45aa05f91865b6073,
      type: 3}
  - m_RefCount: 1
    m_Data: {fileID: -7328903322489970058, guid: b37f98ccd76addb45aa05f91865b6073,
      type: 3}
  - m_RefCount: 1
    m_Data: {fileID: -1368160883090893620, guid: b37f98ccd76addb45aa05f91865b6073,
      type: 3}
  - m_RefCount: 1
    m_Data: {fileID: -7440033521027221975, guid: b37f98ccd76addb45aa05f91865b6073,
      type: 3}
  - m_RefCount: 1
    m_Data: {fileID: -867476535827120782, guid: b37f98ccd76addb45aa05f91865b6073,
      type: 3}
  - m_RefCount: 1
    m_Data: {fileID: 5988159623205625795, guid: b37f98ccd76addb45aa05f91865b6073,
      type: 3}
  - m_RefCount: 1
    m_Data: {fileID: 5946107844408058059, guid: b37f98ccd76addb45aa05f91865b6073,
      type: 3}
  - m_RefCount: 1
    m_Data: {fileID: 4240258909568113634, guid: b37f98ccd76addb45aa05f91865b6073,
      type: 3}
  - m_RefCount: 1
    m_Data: {fileID: 8402039487802154775, guid: b37f98ccd76addb45aa05f91865b6073,
      type: 3}
  - m_RefCount: 1
    m_Data: {fileID: -213256778915348263, guid: b37f98ccd76addb45aa05f91865b6073,
      type: 3}
  - m_RefCount: 1
    m_Data: {fileID: 6022588696295855677, guid: b37f98ccd76addb45aa05f91865b6073,
      type: 3}
  - m_RefCount: 1
    m_Data: {fileID: -6343612055075466837, guid: b37f98ccd76addb45aa05f91865b6073,
      type: 3}
  - m_RefCount: 1
    m_Data: {fileID: -7856721022187222214, guid: b37f98ccd76addb45aa05f91865b6073,
      type: 3}
  - m_RefCount: 1
    m_Data: {fileID: 3525011899623409315, guid: b37f98ccd76addb45aa05f91865b6073,
      type: 3}
  - m_RefCount: 1
    m_Data: {fileID: 4648834215782737833, guid: b37f98ccd76addb45aa05f91865b6073,
      type: 3}
  - m_RefCount: 1
    m_Data: {fileID: -1825857544211820774, guid: b37f98ccd76addb45aa05f91865b6073,
      type: 3}
  - m_RefCount: 1
    m_Data: {fileID: -978268762720683340, guid: b37f98ccd76addb45aa05f91865b6073,
      type: 3}
  - m_RefCount: 1
    m_Data: {fileID: 4029525696095019477, guid: b37f98ccd76addb45aa05f91865b6073,
      type: 3}
  - m_RefCount: 1
    m_Data: {fileID: 7889740894125867095, guid: b37f98ccd76addb45aa05f91865b6073,
      type: 3}
  - m_RefCount: 1
    m_Data: {fileID: 8062555641593088401, guid: b37f98ccd76addb45aa05f91865b6073,
      type: 3}
  - m_RefCount: 1
    m_Data: {fileID: -4263907278557138116, guid: b37f98ccd76addb45aa05f91865b6073,
      type: 3}
  - m_RefCount: 1
    m_Data: {fileID: 4791584742633966585, guid: b37f98ccd76addb45aa05f91865b6073,
      type: 3}
  - m_RefCount: 1
    m_Data: {fileID: 2688631682496163530, guid: b37f98ccd76addb45aa05f91865b6073,
      type: 3}
  - m_RefCount: 1
    m_Data: {fileID: -7502580450580384778, guid: b37f98ccd76addb45aa05f91865b6073,
      type: 3}
  - m_RefCount: 1
    m_Data: {fileID: -6309943539800178902, guid: b37f98ccd76addb45aa05f91865b6073,
      type: 3}
  - m_RefCount: 1
    m_Data: {fileID: -8870002161248126955, guid: b37f98ccd76addb45aa05f91865b6073,
      type: 3}
  - m_RefCount: 1
    m_Data: {fileID: 6566571313871766443, guid: b37f98ccd76addb45aa05f91865b6073,
      type: 3}
  - m_RefCount: 1
    m_Data: {fileID: -5738792144163517125, guid: b37f98ccd76addb45aa05f91865b6073,
      type: 3}
  - m_RefCount: 1
    m_Data: {fileID: -3439580627314472174, guid: b37f98ccd76addb45aa05f91865b6073,
      type: 3}
  - m_RefCount: 1
    m_Data: {fileID: 1205259601336416233, guid: b37f98ccd76addb45aa05f91865b6073,
      type: 3}
  - m_RefCount: 1
    m_Data: {fileID: 5185635711082829126, guid: b37f98ccd76addb45aa05f91865b6073,
      type: 3}
  - m_RefCount: 1
    m_Data: {fileID: 5628807554053300234, guid: b37f98ccd76addb45aa05f91865b6073,
      type: 3}
  - m_RefCount: 1
    m_Data: {fileID: -2424265197748261695, guid: b37f98ccd76addb45aa05f91865b6073,
      type: 3}
  - m_RefCount: 1
    m_Data: {fileID: 6846900701954452094, guid: b37f98ccd76addb45aa05f91865b6073,
      type: 3}
  - m_RefCount: 1
    m_Data: {fileID: 8331740775880089848, guid: b37f98ccd76addb45aa05f91865b6073,
      type: 3}
  - m_RefCount: 1
    m_Data: {fileID: -3075976715401489529, guid: b37f98ccd76addb45aa05f91865b6073,
      type: 3}
  - m_RefCount: 1
    m_Data: {fileID: 6475812983205532032, guid: b37f98ccd76addb45aa05f91865b6073,
      type: 3}
  - m_RefCount: 1
    m_Data: {fileID: 3928146353715714587, guid: b37f98ccd76addb45aa05f91865b6073,
      type: 3}
  - m_RefCount: 1
    m_Data: {fileID: 8459084479756414578, guid: b37f98ccd76addb45aa05f91865b6073,
      type: 3}
  - m_RefCount: 1
    m_Data: {fileID: 8586963152461306841, guid: b37f98ccd76addb45aa05f91865b6073,
      type: 3}
  - m_RefCount: 1
    m_Data: {fileID: -9099604603069663986, guid: b37f98ccd76addb45aa05f91865b6073,
      type: 3}
  - m_RefCount: 1
    m_Data: {fileID: -8586303629988018997, guid: b37f98ccd76addb45aa05f91865b6073,
      type: 3}
  - m_RefCount: 1
    m_Data: {fileID: 8799306476602483283, guid: b37f98ccd76addb45aa05f91865b6073,
      type: 3}
  - m_RefCount: 1
    m_Data: {fileID: -8472032802994099407, guid: b37f98ccd76addb45aa05f91865b6073,
      type: 3}
  - m_RefCount: 1
    m_Data: {fileID: 8137306623506618164, guid: b37f98ccd76addb45aa05f91865b6073,
      type: 3}
  - m_RefCount: 1
    m_Data: {fileID: 8536395188803549266, guid: b37f98ccd76addb45aa05f91865b6073,
      type: 3}
  - m_RefCount: 1
    m_Data: {fileID: -1225468024683588522, guid: b37f98ccd76addb45aa05f91865b6073,
      type: 3}
  - m_RefCount: 1
    m_Data: {fileID: -3092110252937323883, guid: b37f98ccd76addb45aa05f91865b6073,
      type: 3}
  - m_RefCount: 1
    m_Data: {fileID: 3349813210068591481, guid: b37f98ccd76addb45aa05f91865b6073,
      type: 3}
  - m_RefCount: 1
    m_Data: {fileID: -166022333769990754, guid: b37f98ccd76addb45aa05f91865b6073,
      type: 3}
  - m_RefCount: 1
    m_Data: {fileID: 2536026808655571860, guid: b37f98ccd76addb45aa05f91865b6073,
      type: 3}
  - m_RefCount: 1
    m_Data: {fileID: 6886808071254407462, guid: b37f98ccd76addb45aa05f91865b6073,
      type: 3}
  - m_RefCount: 1
    m_Data: {fileID: 6725207183244224814, guid: b37f98ccd76addb45aa05f91865b6073,
      type: 3}
  - m_RefCount: 1
    m_Data: {fileID: -340853997802831487, guid: b37f98ccd76addb45aa05f91865b6073,
      type: 3}
  - m_RefCount: 1
    m_Data: {fileID: -2077252408233958273, guid: b37f98ccd76addb45aa05f91865b6073,
      type: 3}
  - m_RefCount: 1
    m_Data: {fileID: 5072604127843926329, guid: b37f98ccd76addb45aa05f91865b6073,
      type: 3}
  - m_RefCount: 1
    m_Data: {fileID: -8603831151518559562, guid: b37f98ccd76addb45aa05f91865b6073,
      type: 3}
  - m_RefCount: 1
    m_Data: {fileID: 513647589645721122, guid: b37f98ccd76addb45aa05f91865b6073, type: 3}
  - m_RefCount: 1
    m_Data: {fileID: 3969945286976076027, guid: b37f98ccd76addb45aa05f91865b6073,
      type: 3}
  - m_RefCount: 1
    m_Data: {fileID: -7107464735163754528, guid: b37f98ccd76addb45aa05f91865b6073,
      type: 3}
  - m_RefCount: 1
    m_Data: {fileID: 6988476526116908943, guid: b37f98ccd76addb45aa05f91865b6073,
      type: 3}
  - m_RefCount: 1
    m_Data: {fileID: -7697581833104662858, guid: b37f98ccd76addb45aa05f91865b6073,
      type: 3}
  - m_RefCount: 1
    m_Data: {fileID: 6914994825197550296, guid: b37f98ccd76addb45aa05f91865b6073,
      type: 3}
  - m_RefCount: 1
    m_Data: {fileID: -2481211260934051401, guid: b37f98ccd76addb45aa05f91865b6073,
      type: 3}
  - m_RefCount: 1
    m_Data: {fileID: -6730876004060016793, guid: b37f98ccd76addb45aa05f91865b6073,
      type: 3}
  - m_RefCount: 1
    m_Data: {fileID: -724176100919461878, guid: b37f98ccd76addb45aa05f91865b6073,
      type: 3}
  - m_RefCount: 1
    m_Data: {fileID: 6035688604237054676, guid: b37f98ccd76addb45aa05f91865b6073,
      type: 3}
  - m_RefCount: 1
    m_Data: {fileID: 3677437282262723345, guid: b37f98ccd76addb45aa05f91865b6073,
      type: 3}
  - m_RefCount: 1
    m_Data: {fileID: -86337090717389779, guid: b37f98ccd76addb45aa05f91865b6073, type: 3}
  - m_RefCount: 1
    m_Data: {fileID: 7591574379832081920, guid: b37f98ccd76addb45aa05f91865b6073,
      type: 3}
  - m_RefCount: 1
    m_Data: {fileID: 4843949492276788656, guid: b37f98ccd76addb45aa05f91865b6073,
      type: 3}
  - m_RefCount: 1
    m_Data: {fileID: -152631046897623179, guid: b37f98ccd76addb45aa05f91865b6073,
      type: 3}
  - m_RefCount: 1
    m_Data: {fileID: -6379639779361741295, guid: b37f98ccd76addb45aa05f91865b6073,
      type: 3}
  - m_RefCount: 1
    m_Data: {fileID: -3802305750294749761, guid: b37f98ccd76addb45aa05f91865b6073,
      type: 3}
  - m_RefCount: 1
    m_Data: {fileID: 5253272132827496831, guid: b37f98ccd76addb45aa05f91865b6073,
      type: 3}
  - m_RefCount: 1
    m_Data: {fileID: -6641378137751602540, guid: b37f98ccd76addb45aa05f91865b6073,
      type: 3}
  - m_RefCount: 1
    m_Data: {fileID: -4444417952940884755, guid: b37f98ccd76addb45aa05f91865b6073,
      type: 3}
  - m_RefCount: 1
    m_Data: {fileID: -723928992643218010, guid: b37f98ccd76addb45aa05f91865b6073,
      type: 3}
  - m_RefCount: 1
    m_Data: {fileID: -1839042375076574882, guid: b37f98ccd76addb45aa05f91865b6073,
      type: 3}
  - m_RefCount: 1
    m_Data: {fileID: 5754835477608201842, guid: b37f98ccd76addb45aa05f91865b6073,
      type: 3}
  - m_RefCount: 1
    m_Data: {fileID: 7052228113319182890, guid: b37f98ccd76addb45aa05f91865b6073,
      type: 3}
  - m_RefCount: 1
    m_Data: {fileID: 5186718044256924874, guid: b37f98ccd76addb45aa05f91865b6073,
      type: 3}
  - m_RefCount: 1
    m_Data: {fileID: -3705514015054495074, guid: b37f98ccd76addb45aa05f91865b6073,
      type: 3}
  - m_RefCount: 1
    m_Data: {fileID: -6920496655127243831, guid: b37f98ccd76addb45aa05f91865b6073,
      type: 3}
  - m_RefCount: 1
    m_Data: {fileID: 4300294078505063019, guid: b37f98ccd76addb45aa05f91865b6073,
      type: 3}
  - m_RefCount: 1
    m_Data: {fileID: -6755871126702541453, guid: b37f98ccd76addb45aa05f91865b6073,
      type: 3}
  - m_RefCount: 1
    m_Data: {fileID: -7856385794332926340, guid: b37f98ccd76addb45aa05f91865b6073,
      type: 3}
  - m_RefCount: 1
    m_Data: {fileID: 1754175026308698723, guid: b37f98ccd76addb45aa05f91865b6073,
      type: 3}
  - m_RefCount: 1
    m_Data: {fileID: -5664023723989323871, guid: b37f98ccd76addb45aa05f91865b6073,
      type: 3}
  - m_RefCount: 1
    m_Data: {fileID: 3684014525292135090, guid: b37f98ccd76addb45aa05f91865b6073,
      type: 3}
  - m_RefCount: 1
    m_Data: {fileID: -3211658450972291893, guid: b37f98ccd76addb45aa05f91865b6073,
      type: 3}
  - m_RefCount: 1
    m_Data: {fileID: 7269272672968058904, guid: b37f98ccd76addb45aa05f91865b6073,
      type: 3}
  - m_RefCount: 1
    m_Data: {fileID: 464816260518777987, guid: b37f98ccd76addb45aa05f91865b6073, type: 3}
  - m_RefCount: 1
    m_Data: {fileID: -8652210101354061027, guid: b37f98ccd76addb45aa05f91865b6073,
      type: 3}
  - m_RefCount: 1
    m_Data: {fileID: -8870006506803033354, guid: b37f98ccd76addb45aa05f91865b6073,
      type: 3}
  - m_RefCount: 1
    m_Data: {fileID: 2829335080179964570, guid: b37f98ccd76addb45aa05f91865b6073,
      type: 3}
  - m_RefCount: 1
    m_Data: {fileID: -8648784718704300632, guid: b37f98ccd76addb45aa05f91865b6073,
      type: 3}
  - m_RefCount: 1
    m_Data: {fileID: 5276473507412026400, guid: b37f98ccd76addb45aa05f91865b6073,
      type: 3}
  - m_RefCount: 1
    m_Data: {fileID: -9082512036955313644, guid: b37f98ccd76addb45aa05f91865b6073,
      type: 3}
  - m_RefCount: 1
    m_Data: {fileID: -3611528645980518658, guid: b37f98ccd76addb45aa05f91865b6073,
      type: 3}
  - m_RefCount: 1
    m_Data: {fileID: 6021887287985037963, guid: b37f98ccd76addb45aa05f91865b6073,
      type: 3}
  - m_RefCount: 1
    m_Data: {fileID: 918913892718783699, guid: b37f98ccd76addb45aa05f91865b6073, type: 3}
  - m_RefCount: 1
    m_Data: {fileID: 4088520689826249774, guid: b37f98ccd76addb45aa05f91865b6073,
      type: 3}
  - m_RefCount: 1
    m_Data: {fileID: -4522431987662405743, guid: b37f98ccd76addb45aa05f91865b6073,
      type: 3}
  - m_RefCount: 1
    m_Data: {fileID: -7141768575999460921, guid: b37f98ccd76addb45aa05f91865b6073,
      type: 3}
  - m_RefCount: 1
    m_Data: {fileID: -7672360736985600450, guid: b37f98ccd76addb45aa05f91865b6073,
      type: 3}
  - m_RefCount: 1
    m_Data: {fileID: -6833351158675972477, guid: b37f98ccd76addb45aa05f91865b6073,
      type: 3}
  - m_RefCount: 1
    m_Data: {fileID: 7488792047329993953, guid: b37f98ccd76addb45aa05f91865b6073,
      type: 3}
  - m_RefCount: 1
    m_Data: {fileID: 1089747595259552722, guid: b37f98ccd76addb45aa05f91865b6073,
      type: 3}
  - m_RefCount: 1
    m_Data: {fileID: -8680457141437209050, guid: b37f98ccd76addb45aa05f91865b6073,
      type: 3}
  - m_RefCount: 1
    m_Data: {fileID: -7322733754451895842, guid: b37f98ccd76addb45aa05f91865b6073,
      type: 3}
  - m_RefCount: 1
    m_Data: {fileID: -6191558381738350165, guid: b37f98ccd76addb45aa05f91865b6073,
      type: 3}
  - m_RefCount: 2
    m_Data: {fileID: 440371644005365815, guid: b37f98ccd76addb45aa05f91865b6073, type: 3}
  m_TileMatrixArray:
  - m_RefCount: 156
    m_Data:
      e00: 1
      e01: 0
      e02: 0
      e03: 0
      e10: 0
      e11: 1
      e12: 0
      e13: 0
      e20: 0
      e21: 0
      e22: 1
      e23: 0
      e30: 0
      e31: 0
      e32: 0
      e33: 1
  m_TileColorArray:
  - m_RefCount: 156
    m_Data: {r: 1, g: 1, b: 1, a: 1}
  m_TileObjectToInstantiateArray: []
  m_AnimationFrameRate: 1
  m_Color: {r: 1, g: 1, b: 1, a: 1}
  m_Origin: {x: -2, y: -17, z: 0}
  m_Size: {x: 22, y: 20, z: 1}
  m_TileAnchor: {x: 0.5, y: 0.5, z: 0}
  m_TileOrientation: 0
  m_TileOrientationMatrix:
    e00: 1
    e01: 0
    e02: 0
    e03: 0
    e10: 0
    e11: 1
    e12: 0
    e13: 0
    e20: 0
    e21: 0
    e22: 1
    e23: 0
    e30: 0
    e31: 0
    e32: 0
    e33: 1
--- !u!483693784 &7131279842362445334
TilemapRenderer:
  m_ObjectHideFlags: 0
  m_CorrespondingSourceObject: {fileID: 0}
  m_PrefabInstance: {fileID: 0}
  m_PrefabAsset: {fileID: 0}
  m_GameObject: {fileID: 7036964940527805051}
  m_Enabled: 0
  m_CastShadows: 0
  m_ReceiveShadows: 0
  m_DynamicOccludee: 0
  m_MotionVectors: 1
  m_LightProbeUsage: 0
  m_ReflectionProbeUsage: 0
  m_RayTracingMode: 0
  m_RenderingLayerMask: 1
  m_RendererPriority: 0
  m_Materials:
  - {fileID: 10754, guid: 0000000000000000f000000000000000, type: 0}
  m_StaticBatchInfo:
    firstSubMesh: 0
    subMeshCount: 0
  m_StaticBatchRoot: {fileID: 0}
  m_ProbeAnchor: {fileID: 0}
  m_LightProbeVolumeOverride: {fileID: 0}
  m_ScaleInLightmap: 1
  m_ReceiveGI: 1
  m_PreserveUVs: 0
  m_IgnoreNormalsForChartDetection: 0
  m_ImportantGI: 0
  m_StitchLightmapSeams: 1
  m_SelectedEditorRenderState: 0
  m_MinimumChartSize: 4
  m_AutoUVMaxDistance: 0.5
  m_AutoUVMaxAngle: 89
  m_LightmapParameters: {fileID: 0}
  m_SortingLayerID: 0
  m_SortingLayer: 0
  m_SortingOrder: 0
  m_ChunkSize: {x: 32, y: 32, z: 32}
  m_ChunkCullingBounds: {x: 0, y: 0, z: 0}
  m_MaxChunkCount: 16
  m_MaxFrameAge: 16
  m_SortOrder: 0
  m_Mode: 0
  m_DetectChunkCullingBounds: 0
  m_MaskInteraction: 0
--- !u!1 &7225571743890654005
GameObject:
  m_ObjectHideFlags: 0
  m_CorrespondingSourceObject: {fileID: 0}
  m_PrefabInstance: {fileID: 0}
  m_PrefabAsset: {fileID: 0}
  serializedVersion: 6
  m_Component:
  - component: {fileID: 8841216456052420047}
  - component: {fileID: 8277384708863488652}
  m_Layer: 31
  m_Name: House Tiles
  m_TagString: Untagged
  m_Icon: {fileID: 0}
  m_NavMeshLayer: 0
  m_StaticEditorFlags: 0
  m_IsActive: 1
--- !u!4 &8841216456052420047
Transform:
  m_ObjectHideFlags: 0
  m_CorrespondingSourceObject: {fileID: 0}
  m_PrefabInstance: {fileID: 0}
  m_PrefabAsset: {fileID: 0}
  m_GameObject: {fileID: 7225571743890654005}
  m_LocalRotation: {x: 0, y: 0, z: 0, w: 1}
  m_LocalPosition: {x: 0, y: 0, z: 0}
  m_LocalScale: {x: 1, y: 1, z: 1}
  m_Children:
  - {fileID: 8264522815178636798}
  m_Father: {fileID: 0}
  m_RootOrder: 0
  m_LocalEulerAnglesHint: {x: 0, y: 0, z: 0}
--- !u!156049354 &8277384708863488652
Grid:
  m_ObjectHideFlags: 0
  m_CorrespondingSourceObject: {fileID: 0}
  m_PrefabInstance: {fileID: 0}
  m_PrefabAsset: {fileID: 0}
  m_GameObject: {fileID: 7225571743890654005}
  m_Enabled: 1
  m_CellSize: {x: 1, y: 1, z: 0}
  m_CellGap: {x: 0, y: 0, z: 0}
  m_CellLayout: 0
  m_CellSwizzle: 0
--- !u!114 &55117833703032564
MonoBehaviour:
  m_ObjectHideFlags: 0
  m_CorrespondingSourceObject: {fileID: 0}
  m_PrefabInstance: {fileID: 0}
  m_PrefabAsset: {fileID: 0}
  m_GameObject: {fileID: 0}
  m_Enabled: 1
  m_EditorHideFlags: 0
  m_Script: {fileID: 12395, guid: 0000000000000000e000000000000000, type: 0}
  m_Name: Palette Settings
  m_EditorClassIdentifier: 
  cellSizing: 0
