%YAML 1.1
%TAG !u! tag:unity3d.com,2011:
--- !u!114 &11400000
MonoBehaviour:
  m_ObjectHideFlags: 0
  m_CorrespondingSourceObject: {fileID: 0}
  m_PrefabInstance: {fileID: 0}
  m_PrefabAsset: {fileID: 0}
  m_GameObject: {fileID: 0}
  m_Enabled: 1
  m_EditorHideFlags: 0
  m_Script: {fileID: 11500000, guid: 5b9fdba0cfdf6254dafff1545d42ee7d, type: 3}
  m_Name: PlayerInventory
  m_EditorClassIdentifier: 
  Items: []
  OnItemAdded:
    m_PersistentCalls:
      m_Calls:
      - m_Target: {fileID: 11400000, guid: 99e2f0823973dce4c8e6e500f5ecaab1, type: 2}
        m_MethodName: Raise
        m_Mode: 0
        m_Arguments:
          m_ObjectArgument: {fileID: 0}
          m_ObjectArgumentAssemblyTypeName: UnityEngine.Object, UnityEngine
          m_IntArgument: 0
          m_FloatArgument: 0
          m_StringArgument: 
          m_BoolArgument: 0
        m_CallState: 2
  OnItemRemoved:
    m_PersistentCalls:
      m_Calls:
      - m_Target: {fileID: 11400000, guid: 5c544a5685c87a340976e5c5dd5706e5, type: 2}
        m_MethodName: Raise
        m_Mode: 0
        m_Arguments:
          m_ObjectArgument: {fileID: 0}
          m_ObjectArgumentAssemblyTypeName: UnityEngine.Object, UnityEngine
          m_IntArgument: 0
          m_FloatArgument: 0
          m_StringArgument: 
          m_BoolArgument: 0
        m_CallState: 2
