%YAML 1.1
%TAG !u! tag:unity3d.com,2011:
--- !u!114 &11400000
MonoBehaviour:
  m_ObjectHideFlags: 0
  m_CorrespondingSourceObject: {fileID: 0}
  m_PrefabInstance: {fileID: 0}
  m_PrefabAsset: {fileID: 0}
  m_GameObject: {fileID: 0}
  m_Enabled: 1
  m_EditorHideFlags: 0
  m_Script: {fileID: 11500000, guid: ac6a9df5aa423eb4da7285c455bb8709, type: 3}
  m_Name: IsHouseDoorOpen
  m_EditorClassIdentifier: 
  InitialValue: 0
  OnValueChanged:
    m_PersistentCalls:
      m_Calls: []
