{
    "name": "Controllers_Module",
    "references": [
        "ValueReference_Module",
        "Unity.TextMeshPro",
        "Cinemachine"
    ],
    "optionalUnityReferences": [],
    "includePlatforms": [],
    "excludePlatforms": [],
    "allowUnsafeCode": false,
    "overrideReferences": false,
    "precompiledReferences": [],
    "autoReferenced": true,
    "defineConstraints": []
}