%YAML 1.1
%TAG !u! tag:unity3d.com,2011:
--- !u!114 &11400000
MonoBehaviour:
  m_ObjectHideFlags: 0
  m_CorrespondingSourceObject: {fileID: 0}
  m_PrefabInstance: {fileID: 0}
  m_PrefabAsset: {fileID: 0}
  m_GameObject: {fileID: 0}
  m_Enabled: 1
  m_EditorHideFlags: 0
  m_Script: {fileID: 11500000, guid: 71d43fea16f1c974eaea312588343794, type: 3}
  m_Name: ButtonClick
  m_EditorClassIdentifier: 
  clip: {fileID: 8300000, guid: 8b6c31d95a874d54b9eaec39189cedac, type: 3}
  volume: 1
