%YAML 1.1
%TAG !u! tag:unity3d.com,2011:
--- !u!1045 &1
EditorBuildSettings:
  m_ObjectHideFlags: 0
  serializedVersion: 2
  m_Scenes:
  - enabled: 1
    path: Assets/Scenes/Main/MenuInicial.unity
    guid: 99c9720ab356a0642a771bea13969a05
  - enabled: 1
    path: Assets/Scenes/Main/LoadingScene.unity
    guid: 9e077f218b30cac43b23793ae6f51e12
  - enabled: 1
    path: Assets/Scenes/Main/InGame0.unity
    guid: a145d038179f6024898e37bd3af94b8b
  - enabled: 0
    path: 
    guid: 00000000000000000000000000000000
  m_configObjects: {}
