%YAML 1.1
%TAG !u! tag:unity3d.com,2011:
--- !u!114 &11400000
MonoBehaviour:
  m_ObjectHideFlags: 0
  m_CorrespondingSourceObject: {fileID: 0}
  m_PrefabInstance: {fileID: 0}
  m_PrefabAsset: {fileID: 0}
  m_GameObject: {fileID: 0}
  m_Enabled: 1
  m_EditorHideFlags: 0
  m_Script: {fileID: 11500000, guid: 8602b143b17fccf4a9125b31710f45a5, type: 3}
  m_Name: Question 4
  m_EditorClassIdentifier: 
  question: "Combien d'enfants a Bohort selon l'un des \xE9pisodes pilotes ?"
  answers:
  - 4
  - 7
  - 3
  - 9
  correctAnswerIndex: 3
