[
    {
      "name": "Home",
      "url": "/"
    },
    {
      "name": "Blog",
      "url": "/blog"
    },
    {
      "name": "Demo slides",
      "url": "https://graceful-melomakarona-979487.netlify.app/"
    },
    {
      "name": "Contact us",
      "url": "/contact"
    }
  ]