<svg xmlns="http://www.w3.org/2000/svg" viewBox="0 0 25 25">
  <title>search_gray_24x24</title>
  <g id="Layer_2" data-name="Layer 2">
    <g id="Outline_Icons" data-name="Outline Icons">
      <circle class="cls-1" cx="8.85" cy="8.85" r="8.35" style="fill:none;stroke:#707070;stroke-linejoin:round;"/>
      <line class="cls-2" x1="14.75" y1="14.75" x2="24.5" y2="24.5" style="fill:none;stroke:#707070;stroke-linejoin:round;stroke-linecap:round;"/>
    </g>
  </g>
</svg>
