^D:\STEAM\STEAMAPPS\SOURCEMODS\TF1.5SRC\SRC\PUBLIC\TIER0\POINTEROVERRIDE.ASM
"D:\Microsoft Visual Studio 12.0\VC\bin\ml.exe" /safeseh /c /Cp /Zi /Fo".\Release_tf_mod\\pointeroverride.obj" "D:\Steam\steamapps\sourcemods\tf1.5src\src\public\tier0\pointeroverride.asm"
^D:\STEAM\STEAMAPPS\SOURCEMODS\TF1.5SRC\SRC\GAME\CLIENT\CLIENT_TF_MOD.VPC
if exist "..\..\devtools\bin\vpc.exe" "..\..\devtools\bin\vpc.exe" -crc2 "client_tf_mod.vcxproj"if ERRORLEVEL 1 exit /b 1echo crc_complete > D:\Steam\steamapps\sourcemods\tf1.5src\src\game\client\client_tf_mod.vpc.sentinel
