^E:\CODE\TF2-BASE-MASTER\SRC\VGUI2\VGUI_CONTROLS\ANALOGBAR.CPP
E:\CODE\TF2-BASE-MASTER\SRC\VGUI2\VGUI_CONTROLS\DEBUG\VC120.PDB
^E:\CODE\TF2-BASE-MASTER\SRC\VGUI2\VGUI_CONTROLS\ANIMATINGIMAGEPANEL.CPP
E:\CODE\TF2-BASE-MASTER\SRC\VGUI2\VGUI_CONTROLS\DEBUG\VC120.PDB
^E:\CODE\TF2-BASE-MASTER\SRC\VGUI2\VGUI_CONTROLS\ANIMATIONCONTROLLER.CPP
E:\CODE\TF2-BASE-MASTER\SRC\VGUI2\VGUI_CONTROLS\DEBUG\VC120.PDB
^E:\CODE\TF2-BASE-MASTER\SRC\VGUI2\VGUI_CONTROLS\BITMAPIMAGEPANEL.CPP
E:\CODE\TF2-BASE-MASTER\SRC\VGUI2\VGUI_CONTROLS\DEBUG\VC120.PDB
^E:\CODE\TF2-BASE-MASTER\SRC\VGUI2\VGUI_CONTROLS\BUILDFACTORYHELPER.CPP
E:\CODE\TF2-BASE-MASTER\SRC\VGUI2\VGUI_CONTROLS\DEBUG\VC120.PDB
^E:\CODE\TF2-BASE-MASTER\SRC\VGUI2\VGUI_CONTROLS\BUILDGROUP.CPP
E:\CODE\TF2-BASE-MASTER\SRC\VGUI2\VGUI_CONTROLS\DEBUG\VC120.PDB
^E:\CODE\TF2-BASE-MASTER\SRC\VGUI2\VGUI_CONTROLS\BUILDMODEDIALOG.CPP
E:\CODE\TF2-BASE-MASTER\SRC\VGUI2\VGUI_CONTROLS\DEBUG\VC120.PDB
^E:\CODE\TF2-BASE-MASTER\SRC\VGUI2\VGUI_CONTROLS\BUTTON.CPP
E:\CODE\TF2-BASE-MASTER\SRC\VGUI2\VGUI_CONTROLS\DEBUG\VC120.PDB
^E:\CODE\TF2-BASE-MASTER\SRC\VGUI2\VGUI_CONTROLS\CHECKBUTTON.CPP
E:\CODE\TF2-BASE-MASTER\SRC\VGUI2\VGUI_CONTROLS\DEBUG\VC120.PDB
^E:\CODE\TF2-BASE-MASTER\SRC\VGUI2\VGUI_CONTROLS\CHECKBUTTONLIST.CPP
E:\CODE\TF2-BASE-MASTER\SRC\VGUI2\VGUI_CONTROLS\DEBUG\VC120.PDB
^E:\CODE\TF2-BASE-MASTER\SRC\VGUI2\VGUI_CONTROLS\CIRCULARPROGRESSBAR.CPP
E:\CODE\TF2-BASE-MASTER\SRC\VGUI2\VGUI_CONTROLS\DEBUG\VC120.PDB
^E:\CODE\TF2-BASE-MASTER\SRC\VGUI2\VGUI_CONTROLS\COMBOBOX.CPP
E:\CODE\TF2-BASE-MASTER\SRC\VGUI2\VGUI_CONTROLS\DEBUG\VC120.PDB
^E:\CODE\TF2-BASE-MASTER\SRC\VGUI2\VGUI_CONTROLS\CONSOLEDIALOG.CPP
E:\CODE\TF2-BASE-MASTER\SRC\VGUI2\VGUI_CONTROLS\DEBUG\VC120.PDB
^E:\CODE\TF2-BASE-MASTER\SRC\VGUI2\VGUI_CONTROLS\CONTROLLERMAP.CPP
E:\CODE\TF2-BASE-MASTER\SRC\VGUI2\VGUI_CONTROLS\DEBUG\VC120.PDB
^E:\CODE\TF2-BASE-MASTER\SRC\VGUI2\VGUI_CONTROLS\CONTROLS.CPP
E:\CODE\TF2-BASE-MASTER\SRC\VGUI2\VGUI_CONTROLS\DEBUG\VC120.PDB
^E:\CODE\TF2-BASE-MASTER\SRC\PUBLIC\FILESYSTEM_HELPERS.CPP
E:\CODE\TF2-BASE-MASTER\SRC\VGUI2\VGUI_CONTROLS\DEBUG\VC120.PDB
^E:\CODE\TF2-BASE-MASTER\SRC\VGUI2\SRC\VGUI_KEY_TRANSLATION.CPP
E:\CODE\TF2-BASE-MASTER\SRC\VGUI2\VGUI_CONTROLS\DEBUG\VC120.PDB
^E:\CODE\TF2-BASE-MASTER\SRC\VGUI2\VGUI_CONTROLS\CVARTOGGLECHECKBUTTON.CPP
E:\CODE\TF2-BASE-MASTER\SRC\VGUI2\VGUI_CONTROLS\DEBUG\VC120.PDB
^E:\CODE\TF2-BASE-MASTER\SRC\VGUI2\VGUI_CONTROLS\DIRECTORYSELECTDIALOG.CPP
E:\CODE\TF2-BASE-MASTER\SRC\VGUI2\VGUI_CONTROLS\DEBUG\VC120.PDB
^E:\CODE\TF2-BASE-MASTER\SRC\VGUI2\VGUI_CONTROLS\DIVIDER.CPP
E:\CODE\TF2-BASE-MASTER\SRC\VGUI2\VGUI_CONTROLS\DEBUG\VC120.PDB
^E:\CODE\TF2-BASE-MASTER\SRC\VGUI2\VGUI_CONTROLS\EDITABLEPANEL.CPP
E:\CODE\TF2-BASE-MASTER\SRC\VGUI2\VGUI_CONTROLS\DEBUG\VC120.PDB
^E:\CODE\TF2-BASE-MASTER\SRC\VGUI2\VGUI_CONTROLS\EXPANDBUTTON.CPP
E:\CODE\TF2-BASE-MASTER\SRC\VGUI2\VGUI_CONTROLS\DEBUG\VC120.PDB
^E:\CODE\TF2-BASE-MASTER\SRC\VGUI2\VGUI_CONTROLS\FILEOPENDIALOG.CPP
E:\CODE\TF2-BASE-MASTER\SRC\VGUI2\VGUI_CONTROLS\DEBUG\VC120.PDB
^E:\CODE\TF2-BASE-MASTER\SRC\VGUI2\VGUI_CONTROLS\FILEOPENSTATEMACHINE.CPP
E:\CODE\TF2-BASE-MASTER\SRC\VGUI2\VGUI_CONTROLS\DEBUG\VC120.PDB
^E:\CODE\TF2-BASE-MASTER\SRC\VGUI2\VGUI_CONTROLS\FOCUSNAVGROUP.CPP
E:\CODE\TF2-BASE-MASTER\SRC\VGUI2\VGUI_CONTROLS\DEBUG\VC120.PDB
^E:\CODE\TF2-BASE-MASTER\SRC\VGUI2\VGUI_CONTROLS\FRAME.CPP
E:\CODE\TF2-BASE-MASTER\SRC\VGUI2\VGUI_CONTROLS\DEBUG\VC120.PDB
^E:\CODE\TF2-BASE-MASTER\SRC\VGUI2\VGUI_CONTROLS\GRAPHPANEL.CPP
E:\CODE\TF2-BASE-MASTER\SRC\VGUI2\VGUI_CONTROLS\DEBUG\VC120.PDB
^E:\CODE\TF2-BASE-MASTER\SRC\VGUI2\VGUI_CONTROLS\HTML.CPP
E:\CODE\TF2-BASE-MASTER\SRC\VGUI2\VGUI_CONTROLS\DEBUG\VC120.PDB
^E:\CODE\TF2-BASE-MASTER\SRC\VGUI2\VGUI_CONTROLS\IMAGE.CPP
E:\CODE\TF2-BASE-MASTER\SRC\VGUI2\VGUI_CONTROLS\DEBUG\VC120.PDB
^E:\CODE\TF2-BASE-MASTER\SRC\VGUI2\VGUI_CONTROLS\IMAGELIST.CPP
E:\CODE\TF2-BASE-MASTER\SRC\VGUI2\VGUI_CONTROLS\DEBUG\VC120.PDB
^E:\CODE\TF2-BASE-MASTER\SRC\VGUI2\VGUI_CONTROLS\IMAGEPANEL.CPP
E:\CODE\TF2-BASE-MASTER\SRC\VGUI2\VGUI_CONTROLS\DEBUG\VC120.PDB
^E:\CODE\TF2-BASE-MASTER\SRC\VGUI2\VGUI_CONTROLS\INPUTDIALOG.CPP
E:\CODE\TF2-BASE-MASTER\SRC\VGUI2\VGUI_CONTROLS\DEBUG\VC120.PDB
^E:\CODE\TF2-BASE-MASTER\SRC\VGUI2\VGUI_CONTROLS\KEYBINDINGHELPDIALOG.CPP
E:\CODE\TF2-BASE-MASTER\SRC\VGUI2\VGUI_CONTROLS\DEBUG\VC120.PDB
^E:\CODE\TF2-BASE-MASTER\SRC\VGUI2\VGUI_CONTROLS\KEYBOARDEDITORDIALOG.CPP
E:\CODE\TF2-BASE-MASTER\SRC\VGUI2\VGUI_CONTROLS\DEBUG\VC120.PDB
^E:\CODE\TF2-BASE-MASTER\SRC\VGUI2\VGUI_CONTROLS\KEYREPEAT.CPP
E:\CODE\TF2-BASE-MASTER\SRC\VGUI2\VGUI_CONTROLS\DEBUG\VC120.PDB
^E:\CODE\TF2-BASE-MASTER\SRC\VGUI2\VGUI_CONTROLS\LABEL.CPP
E:\CODE\TF2-BASE-MASTER\SRC\VGUI2\VGUI_CONTROLS\DEBUG\VC120.PDB
^E:\CODE\TF2-BASE-MASTER\SRC\VGUI2\VGUI_CONTROLS\LISTPANEL.CPP
E:\CODE\TF2-BASE-MASTER\SRC\VGUI2\VGUI_CONTROLS\DEBUG\VC120.PDB
^E:\CODE\TF2-BASE-MASTER\SRC\VGUI2\VGUI_CONTROLS\LISTVIEWPANEL.CPP
E:\CODE\TF2-BASE-MASTER\SRC\VGUI2\VGUI_CONTROLS\DEBUG\VC120.PDB
^E:\CODE\TF2-BASE-MASTER\SRC\VGUI2\VGUI_CONTROLS\MENU.CPP
E:\CODE\TF2-BASE-MASTER\SRC\VGUI2\VGUI_CONTROLS\DEBUG\VC120.PDB
^E:\CODE\TF2-BASE-MASTER\SRC\VGUI2\VGUI_CONTROLS\MENUBAR.CPP
E:\CODE\TF2-BASE-MASTER\SRC\VGUI2\VGUI_CONTROLS\DEBUG\VC120.PDB
^E:\CODE\TF2-BASE-MASTER\SRC\VGUI2\VGUI_CONTROLS\MENUBUTTON.CPP
E:\CODE\TF2-BASE-MASTER\SRC\VGUI2\VGUI_CONTROLS\DEBUG\VC120.PDB
^E:\CODE\TF2-BASE-MASTER\SRC\VGUI2\VGUI_CONTROLS\MENUITEM.CPP
E:\CODE\TF2-BASE-MASTER\SRC\VGUI2\VGUI_CONTROLS\DEBUG\VC120.PDB
^E:\CODE\TF2-BASE-MASTER\SRC\VGUI2\VGUI_CONTROLS\MESSAGEBOX.CPP
E:\CODE\TF2-BASE-MASTER\SRC\VGUI2\VGUI_CONTROLS\DEBUG\VC120.PDB
^E:\CODE\TF2-BASE-MASTER\SRC\VGUI2\VGUI_CONTROLS\MESSAGEDIALOG.CPP
E:\CODE\TF2-BASE-MASTER\SRC\VGUI2\VGUI_CONTROLS\DEBUG\VC120.PDB
^E:\CODE\TF2-BASE-MASTER\SRC\VGUI2\VGUI_CONTROLS\PANEL.CPP
E:\CODE\TF2-BASE-MASTER\SRC\VGUI2\VGUI_CONTROLS\DEBUG\VC120.PDB
^E:\CODE\TF2-BASE-MASTER\SRC\VGUI2\VGUI_CONTROLS\PANELLISTPANEL.CPP
E:\CODE\TF2-BASE-MASTER\SRC\VGUI2\VGUI_CONTROLS\DEBUG\VC120.PDB
^E:\CODE\TF2-BASE-MASTER\SRC\VGUI2\VGUI_CONTROLS\PERFORCEFILEEXPLORER.CPP
E:\CODE\TF2-BASE-MASTER\SRC\VGUI2\VGUI_CONTROLS\DEBUG\VC120.PDB
^E:\CODE\TF2-BASE-MASTER\SRC\VGUI2\VGUI_CONTROLS\PERFORCEFILELIST.CPP
E:\CODE\TF2-BASE-MASTER\SRC\VGUI2\VGUI_CONTROLS\DEBUG\VC120.PDB
^E:\CODE\TF2-BASE-MASTER\SRC\VGUI2\VGUI_CONTROLS\PROGRESSBAR.CPP
E:\CODE\TF2-BASE-MASTER\SRC\VGUI2\VGUI_CONTROLS\DEBUG\VC120.PDB
^E:\CODE\TF2-BASE-MASTER\SRC\VGUI2\VGUI_CONTROLS\PROGRESSBOX.CPP
E:\CODE\TF2-BASE-MASTER\SRC\VGUI2\VGUI_CONTROLS\DEBUG\VC120.PDB
^E:\CODE\TF2-BASE-MASTER\SRC\VGUI2\VGUI_CONTROLS\PROPERTYDIALOG.CPP
E:\CODE\TF2-BASE-MASTER\SRC\VGUI2\VGUI_CONTROLS\DEBUG\VC120.PDB
^E:\CODE\TF2-BASE-MASTER\SRC\VGUI2\VGUI_CONTROLS\PROPERTYPAGE.CPP
E:\CODE\TF2-BASE-MASTER\SRC\VGUI2\VGUI_CONTROLS\DEBUG\VC120.PDB
^E:\CODE\TF2-BASE-MASTER\SRC\VGUI2\VGUI_CONTROLS\PROPERTYSHEET.CPP
E:\CODE\TF2-BASE-MASTER\SRC\VGUI2\VGUI_CONTROLS\DEBUG\VC120.PDB
^E:\CODE\TF2-BASE-MASTER\SRC\VGUI2\VGUI_CONTROLS\QUERYBOX.CPP
E:\CODE\TF2-BASE-MASTER\SRC\VGUI2\VGUI_CONTROLS\DEBUG\VC120.PDB
^E:\CODE\TF2-BASE-MASTER\SRC\VGUI2\VGUI_CONTROLS\RADIOBUTTON.CPP
E:\CODE\TF2-BASE-MASTER\SRC\VGUI2\VGUI_CONTROLS\DEBUG\VC120.PDB
^E:\CODE\TF2-BASE-MASTER\SRC\VGUI2\VGUI_CONTROLS\RICHTEXT.CPP
E:\CODE\TF2-BASE-MASTER\SRC\VGUI2\VGUI_CONTROLS\DEBUG\VC120.PDB
^E:\CODE\TF2-BASE-MASTER\SRC\VGUI2\VGUI_CONTROLS\ROTATINGPROGRESSBAR.CPP
E:\CODE\TF2-BASE-MASTER\SRC\VGUI2\VGUI_CONTROLS\DEBUG\VC120.PDB
^E:\CODE\TF2-BASE-MASTER\SRC\VGUI2\VGUI_CONTROLS\SCALABLEIMAGEPANEL.CPP
E:\CODE\TF2-BASE-MASTER\SRC\VGUI2\VGUI_CONTROLS\DEBUG\VC120.PDB
^E:\CODE\TF2-BASE-MASTER\SRC\VGUI2\VGUI_CONTROLS\SCROLLBAR.CPP
E:\CODE\TF2-BASE-MASTER\SRC\VGUI2\VGUI_CONTROLS\DEBUG\VC120.PDB
^E:\CODE\TF2-BASE-MASTER\SRC\VGUI2\VGUI_CONTROLS\SCROLLBARSLIDER.CPP
E:\CODE\TF2-BASE-MASTER\SRC\VGUI2\VGUI_CONTROLS\DEBUG\VC120.PDB
^E:\CODE\TF2-BASE-MASTER\SRC\VGUI2\VGUI_CONTROLS\SCROLLABLEEDITABLEPANEL.CPP
E:\CODE\TF2-BASE-MASTER\SRC\VGUI2\VGUI_CONTROLS\DEBUG\VC120.PDB
^E:\CODE\TF2-BASE-MASTER\SRC\VGUI2\VGUI_CONTROLS\SECTIONEDLISTPANEL.CPP
E:\CODE\TF2-BASE-MASTER\SRC\VGUI2\VGUI_CONTROLS\DEBUG\VC120.PDB
^E:\CODE\TF2-BASE-MASTER\SRC\VGUI2\VGUI_CONTROLS\SLIDER.CPP
E:\CODE\TF2-BASE-MASTER\SRC\VGUI2\VGUI_CONTROLS\DEBUG\VC120.PDB
^E:\CODE\TF2-BASE-MASTER\SRC\VGUI2\VGUI_CONTROLS\SPLITTER.CPP
E:\CODE\TF2-BASE-MASTER\SRC\VGUI2\VGUI_CONTROLS\DEBUG\VC120.PDB
^E:\CODE\TF2-BASE-MASTER\SRC\VGUI2\VGUI_CONTROLS\TEXTENTRY.CPP
E:\CODE\TF2-BASE-MASTER\SRC\VGUI2\VGUI_CONTROLS\DEBUG\VC120.PDB
^E:\CODE\TF2-BASE-MASTER\SRC\VGUI2\VGUI_CONTROLS\TEXTIMAGE.CPP
E:\CODE\TF2-BASE-MASTER\SRC\VGUI2\VGUI_CONTROLS\DEBUG\VC120.PDB
^E:\CODE\TF2-BASE-MASTER\SRC\VGUI2\VGUI_CONTROLS\TOGGLEBUTTON.CPP
E:\CODE\TF2-BASE-MASTER\SRC\VGUI2\VGUI_CONTROLS\DEBUG\VC120.PDB
^E:\CODE\TF2-BASE-MASTER\SRC\VGUI2\VGUI_CONTROLS\TOOLWINDOW.CPP
E:\CODE\TF2-BASE-MASTER\SRC\VGUI2\VGUI_CONTROLS\DEBUG\VC120.PDB
^E:\CODE\TF2-BASE-MASTER\SRC\VGUI2\VGUI_CONTROLS\TOOLTIP.CPP
E:\CODE\TF2-BASE-MASTER\SRC\VGUI2\VGUI_CONTROLS\DEBUG\VC120.PDB
^E:\CODE\TF2-BASE-MASTER\SRC\VGUI2\VGUI_CONTROLS\TREEVIEW.CPP
E:\CODE\TF2-BASE-MASTER\SRC\VGUI2\VGUI_CONTROLS\DEBUG\VC120.PDB
^E:\CODE\TF2-BASE-MASTER\SRC\VGUI2\VGUI_CONTROLS\TREEVIEWLISTCONTROL.CPP
E:\CODE\TF2-BASE-MASTER\SRC\VGUI2\VGUI_CONTROLS\DEBUG\VC120.PDB
^E:\CODE\TF2-BASE-MASTER\SRC\VGUI2\VGUI_CONTROLS\URLLABEL.CPP
E:\CODE\TF2-BASE-MASTER\SRC\VGUI2\VGUI_CONTROLS\DEBUG\VC120.PDB
^E:\CODE\TF2-BASE-MASTER\SRC\VGUI2\VGUI_CONTROLS\WIZARDPANEL.CPP
E:\CODE\TF2-BASE-MASTER\SRC\VGUI2\VGUI_CONTROLS\DEBUG\VC120.PDB
^E:\CODE\TF2-BASE-MASTER\SRC\VGUI2\VGUI_CONTROLS\WIZARDSUBPANEL.CPP
E:\CODE\TF2-BASE-MASTER\SRC\VGUI2\VGUI_CONTROLS\DEBUG\VC120.PDB
^E:\CODE\TF2-BASE-MASTER\SRC\VGUI2\VGUI_CONTROLS\PERFORCEFILELISTFRAME.CPP
E:\CODE\TF2-BASE-MASTER\SRC\VGUI2\VGUI_CONTROLS\DEBUG\VC120.PDB
^E:\CODE\TF2-BASE-MASTER\SRC\VGUI2\VGUI_CONTROLS\SAVEDOCUMENTQUERY.CPP
E:\CODE\TF2-BASE-MASTER\SRC\VGUI2\VGUI_CONTROLS\DEBUG\VC120.PDB
^E:\CODE\TF2-BASE-MASTER\SRC\VGUI2\VGUI_CONTROLS\SUBRECTIMAGE.CPP
E:\CODE\TF2-BASE-MASTER\SRC\VGUI2\VGUI_CONTROLS\DEBUG\VC120.PDB
