[
    {
        "prim": "DIP",
        "args": [
            [
                {
                    "prim": "NIL",
                    "args": [
                        {
                            "prim": "operation"
                        }
                    ]
                }
            ]
        ]
    }
]
