{
    "type": "transaction",
    "id": 33697178,
    "level": 1165911,
    "timestamp": "2020-10-11T01:02:44Z",
    "block": "BLdN6v8DBmsJXrHXUmC2zz7zPK5x8iYzsYLkx66ofgg8qhotGdn",
    "hash": "oo8huv677AxRTa7tj4ZKRSrtrn66SmN3QrAk3xmG7cqTPh1VacP",
    "counter": 7224498,
    "sender": {
        "address": "tz1gV3LBv1XmVEkdeRTjuUdurvCf8P85eALM"
    },
    "gasLimit": 205523,
    "gasUsed": 205423,
    "storageLimit": 0,
    "storageUsed": 0,
    "bakerFee": 20909,
    "storageFee": 0,
    "allocationFee": 0,
    "target": {
        "alias": "tzBTC",
        "address": "KT1PWx2mnDueood7fEmfbBDKx1D9BAnnXitn"
    },
    "amount": 0,
    "parameters": "{\"entrypoint\":\"approve\",\"value\":{\"prim\":\"Pair\",\"args\":[{\"string\":\"KT1DrJV8vhkdLEj76h1H9Q4irZDqAkMPo1Qf\"},{\"int\":\"19089730\"}]}}",
    "status": "applied",
    "hasInternals": false
}
