// Jest Snapshot v1, https://goo.gl/fbAQLP

exports[`Snapshots Not selected; Size 14px 1`] = `
.emotion-0 {
  line-height: 13px;
  font-size: 10px;
  display: inline-block;
  color: #82828B;
  font-family: Source Sans Pro,sans-serif;
  width: auto;
  text-overflow: initial;
  max-width: 100%;
  overflow: visible;
  line-height: 16px;
  font-size: 14px;
}

.emotion-0>* {
  color: #82828B;
}

<div>
  <span
    class="text emotion-0"
  >
    <i
      class="icon-unchecked"
    />
  </span>
</div>
`;

exports[`Snapshots Selected 1`] = `
.emotion-0 {
  line-height: 13px;
  font-size: 10px;
  display: inline-block;
  color: #2B3B9B;
  font-family: Source Sans Pro,sans-serif;
  width: auto;
  text-overflow: initial;
  max-width: 100%;
  overflow: visible;
  line-height: 14px;
  font-size: 12px;
}

.emotion-0>* {
  color: #2B3B9B;
}

<div>
  <span
    class="text emotion-0"
  >
    <i
      class="icon-checked"
    />
  </span>
</div>
`;
