{
    "contents": [
        {
            "kind": "transaction",
            "source": "tz1S82rGFZK8cVbNDpP1Hf9VhTUa4W8oc2WV",
            "fee": "0",
            "counter": "552919",
            "gas_limit": "1040000",
            "storage_limit": "60000",
            "amount": "0",
            "destination": "KT1Njyz94x2pNJGh5uMhKj24VB9JsGCdkySN",
            "parameters": {
                "entrypoint": "default",
                "value": [
                    {
                        "prim": "PUSH",
                        "args": [
                            {
                                "prim": "mutez"
                            },
                            {
                                "int": "0"
                            }
                        ]
                    },
                    {
                        "prim": "NONE",
                        "args": [
                            {
                                "prim": "key_hash"
                            }
                        ]
                    },
                    {
                        "prim": "CREATE_CONTRACT",
                        "args": [
                            [
                                {
                                    "prim": "parameter",
                                    "args": [
                                        {
                                            "prim": "nat"
                                        }
                                    ]
                                },
                                {
                                    "prim": "storage",
                                    "args": [
                                        {
                                            "prim": "unit"
                                        }
                                    ]
                                },
                                {
                                    "prim": "code",
                                    "args": [
                                        [
                                            {
                                                "prim": "FAILWITH"
                                            }
                                        ]
                                    ]
                                }
                            ]
                        ]
                    },
                    {
                        "prim": "DIP",
                        "args": [
                            [
                                {
                                    "prim": "DIP",
                                    "args": [
                                        [
                                            {
                                                "prim": "LAMBDA",
                                                "args": [
                                                    {
                                                        "prim": "pair",
                                                        "args": [
                                                            {
                                                                "prim": "address"
                                                            },
                                                            {
                                                                "prim": "unit"
                                                            }
                                                        ]
                                                    },
                                                    {
                                                        "prim": "pair",
                                                        "args": [
                                                            {
                                                                "prim": "list",
                                                                "args": [
                                                                    {
                                                                        "prim": "operation"
                                                                    }
                                                                ]
                                                            },
                                                            {
                                                                "prim": "unit"
                                                            }
                                                        ]
                                                    },
                                                    [
                                                        {
                                                            "prim": "CAR"
                                                        },
                                                        {
                                                            "prim": "CONTRACT",
                                                            "args": [
                                                                {
                                                                    "prim": "nat"
                                                                }
                                                            ]
                                                        },
                                                        {
                                                            "prim": "IF_NONE",
                                                            "args": [
                                                                [
                                                                    {
                                                                        "prim": "PUSH",
                                                                        "args": [
                                                                            {
                                                                                "prim": "string"
                                                                            },
                                                                            {
                                                                                "string": "a"
                                                                            }
                                                                        ]
                                                                    },
                                                                    {
                                                                        "prim": "FAILWITH"
                                                                    }
                                                                ],
                                                                []
                                                            ]
                                                        },
                                                        {
                                                            "prim": "PUSH",
                                                            "args": [
                                                                {
                                                                    "prim": "address"
                                                                },
                                                                {
                                                                    "string": "tz1MQehPikysuVYN5hTiKTnrsFidAww7rv3z"
                                                                }
                                                            ]
                                                        },
                                                        {
                                                            "prim": "PAIR"
                                                        },
                                                        {
                                                            "prim": "DIP",
                                                            "args": [
                                                                [
                                                                    {
                                                                        "prim": "PUSH",
                                                                        "args": [
                                                                            {
                                                                                "prim": "address"
                                                                            },
                                                                            {
                                                                                "string": "KT1U8kHUKJVcPkzjHLahLxmnXGnK1StAeNjK"
                                                                            }
                                                                        ]
                                                                    },
                                                                    {
                                                                        "prim": "CONTRACT",
                                                                        "args": [
                                                                            {
                                                                                "prim": "pair",
                                                                                "args": [
                                                                                    {
                                                                                        "prim": "address"
                                                                                    },
                                                                                    {
                                                                                        "prim": "contract",
                                                                                        "args": [
                                                                                            {
                                                                                                "prim": "nat"
                                                                                            }
                                                                                        ]
                                                                                    }
                                                                                ]
                                                                            }
                                                                        ],
                                                                        "annots": [
                                                                            "%getBalance"
                                                                        ]
                                                                    },
                                                                    {
                                                                        "prim": "IF_NONE",
                                                                        "args": [
                                                                            [
                                                                                {
                                                                                    "prim": "PUSH",
                                                                                    "args": [
                                                                                        {
                                                                                            "prim": "string"
                                                                                        },
                                                                                        {
                                                                                            "string": "b"
                                                                                        }
                                                                                    ]
                                                                                },
                                                                                {
                                                                                    "prim": "FAILWITH"
                                                                                }
                                                                            ],
                                                                            []
                                                                        ]
                                                                    },
                                                                    {
                                                                        "prim": "PUSH",
                                                                        "args": [
                                                                            {
                                                                                "prim": "mutez"
                                                                            },
                                                                            {
                                                                                "int": "0"
                                                                            }
                                                                        ]
                                                                    }
                                                                ]
                                                            ]
                                                        },
                                                        {
                                                            "prim": "TRANSFER_TOKENS"
                                                        },
                                                        {
                                                            "prim": "DIP",
                                                            "args": [
                                                                [
                                                                    {
                                                                        "prim": "NIL",
                                                                        "args": [
                                                                            {
                                                                                "prim": "operation"
                                                                            }
                                                                        ]
                                                                    }
                                                                ]
                                                            ]
                                                        },
                                                        {
                                                            "prim": "CONS"
                                                        },
                                                        {
                                                            "prim": "DIP",
                                                            "args": [
                                                                [
                                                                    {
                                                                        "prim": "UNIT"
                                                                    }
                                                                ]
                                                            ]
                                                        },
                                                        {
                                                            "prim": "PAIR"
                                                        }
                                                    ]
                                                ]
                                            }
                                        ]
                                    ]
                                },
                                {
                                    "prim": "APPLY"
                                },
                                {
                                    "prim": "DIP",
                                    "args": [
                                        [
                                            {
                                                "prim": "PUSH",
                                                "args": [
                                                    {
                                                        "prim": "address"
                                                    },
                                                    {
                                                        "string": "KT1Njyz94x2pNJGh5uMhKj24VB9JsGCdkySN"
                                                    }
                                                ]
                                            },
                                            {
                                                "prim": "CONTRACT",
                                                "args": [
                                                    {
                                                        "prim": "lambda",
                                                        "args": [
                                                            {
                                                                "prim": "unit"
                                                            },
                                                            {
                                                                "prim": "pair",
                                                                "args": [
                                                                    {
                                                                        "prim": "list",
                                                                        "args": [
                                                                            {
                                                                                "prim": "operation"
                                                                            }
                                                                        ]
                                                                    },
                                                                    {
                                                                        "prim": "unit"
                                                                    }
                                                                ]
                                                            }
                                                        ]
                                                    }
                                                ]
                                            },
                                            {
                                                "prim": "IF_NONE",
                                                "args": [
                                                    [
                                                        {
                                                            "prim": "PUSH",
                                                            "args": [
                                                                {
                                                                    "prim": "string"
                                                                },
                                                                {
                                                                    "string": "c"
                                                                }
                                                            ]
                                                        },
                                                        {
                                                            "prim": "FAILWITH"
                                                        }
                                                    ],
                                                    []
                                                ]
                                            },
                                            {
                                                "prim": "PUSH",
                                                "args": [
                                                    {
                                                        "prim": "mutez"
                                                    },
                                                    {
                                                        "int": "0"
                                                    }
                                                ]
                                            }
                                        ]
                                    ]
                                },
                                {
                                    "prim": "TRANSFER_TOKENS"
                                },
                                {
                                    "prim": "DIP",
                                    "args": [
                                        [
                                            {
                                                "prim": "NIL",
                                                "args": [
                                                    {
                                                        "prim": "operation"
                                                    }
                                                ]
                                            }
                                        ]
                                    ]
                                },
                                {
                                    "prim": "CONS"
                                }
                            ]
                        ]
                    },
                    {
                        "prim": "CONS"
                    },
                    {
                        "prim": "DIP",
                        "args": [
                            [
                                {
                                    "prim": "UNIT"
                                }
                            ]
                        ]
                    },
                    {
                        "prim": "PAIR"
                    }
                ]
            },
            "metadata": {
                "balance_updates": [],
                "operation_result": {
                    "status": "backtracked",
                    "storage": {
                        "prim": "Unit"
                    },
                    "consumed_gas": "26984",
                    "storage_size": "46"
                },
                "internal_operation_results": [
                    {
                        "kind": "origination",
                        "source": "KT1Njyz94x2pNJGh5uMhKj24VB9JsGCdkySN",
                        "nonce": 0,
                        "balance": "0",
                        "script": {
                            "code": [
                                {
                                    "prim": "parameter",
                                    "args": [
                                        {
                                            "prim": "nat"
                                        }
                                    ]
                                },
                                {
                                    "prim": "storage",
                                    "args": [
                                        {
                                            "prim": "unit"
                                        }
                                    ]
                                },
                                {
                                    "prim": "code",
                                    "args": [
                                        [
                                            {
                                                "prim": "FAILWITH"
                                            }
                                        ]
                                    ]
                                }
                            ],
                            "storage": {
                                "prim": "Unit"
                            }
                        },
                        "result": {
                            "status": "backtracked",
                            "big_map_diff": [],
                            "balance_updates": [
                                {
                                    "kind": "contract",
                                    "contract": "tz1S82rGFZK8cVbNDpP1Hf9VhTUa4W8oc2WV",
                                    "change": "-32000"
                                },
                                {
                                    "kind": "contract",
                                    "contract": "tz1S82rGFZK8cVbNDpP1Hf9VhTUa4W8oc2WV",
                                    "change": "-257000"
                                }
                            ],
                            "originated_contracts": [
                                "KT1RTPET3gNv6AwZey7mYzNShC5dNteVu18E"
                            ],
                            "consumed_gas": "10696",
                            "storage_size": "32",
                            "paid_storage_size_diff": "32"
                        }
                    },
                    {
                        "kind": "transaction",
                        "source": "KT1Njyz94x2pNJGh5uMhKj24VB9JsGCdkySN",
                        "nonce": 1,
                        "amount": "0",
                        "destination": "KT1Njyz94x2pNJGh5uMhKj24VB9JsGCdkySN",
                        "parameters": {
                            "entrypoint": "default",
                            "value": [
                                {
                                    "prim": "PUSH",
                                    "args": [
                                        {
                                            "prim": "address"
                                        },
                                        {
                                            "bytes": "01b914957bcd033f5616766476cedef974cc7c2bcb00"
                                        }
                                    ]
                                },
                                {
                                    "prim": "PAIR"
                                },
                                [
                                    {
                                        "prim": "CAR"
                                    },
                                    {
                                        "prim": "CONTRACT",
                                        "args": [
                                            {
                                                "prim": "nat"
                                            }
                                        ]
                                    },
                                    {
                                        "prim": "IF_NONE",
                                        "args": [
                                            [
                                                {
                                                    "prim": "PUSH",
                                                    "args": [
                                                        {
                                                            "prim": "string"
                                                        },
                                                        {
                                                            "string": "a"
                                                        }
                                                    ]
                                                },
                                                {
                                                    "prim": "FAILWITH"
                                                }
                                            ],
                                            []
                                        ]
                                    },
                                    {
                                        "prim": "PUSH",
                                        "args": [
                                            {
                                                "prim": "address"
                                            },
                                            {
                                                "bytes": "000013687bbb1298ad36a4bdb2c5da2f126a59aac007"
                                            }
                                        ]
                                    },
                                    {
                                        "prim": "PAIR"
                                    },
                                    {
                                        "prim": "DIP",
                                        "args": [
                                            [
                                                {
                                                    "prim": "PUSH",
                                                    "args": [
                                                        {
                                                            "prim": "address"
                                                        },
                                                        {
                                                            "bytes": "01d676a1a3e2e602bbb478bb188265fdec8f09124d00"
                                                        }
                                                    ]
                                                },
                                                {
                                                    "prim": "CONTRACT",
                                                    "args": [
                                                        {
                                                            "prim": "pair",
                                                            "args": [
                                                                {
                                                                    "prim": "address"
                                                                },
                                                                {
                                                                    "prim": "contract",
                                                                    "args": [
                                                                        {
                                                                            "prim": "nat"
                                                                        }
                                                                    ]
                                                                }
                                                            ]
                                                        }
                                                    ],
                                                    "annots": [
                                                        "%getBalance"
                                                    ]
                                                },
                                                {
                                                    "prim": "IF_NONE",
                                                    "args": [
                                                        [
                                                            {
                                                                "prim": "PUSH",
                                                                "args": [
                                                                    {
                                                                        "prim": "string"
                                                                    },
                                                                    {
                                                                        "string": "b"
                                                                    }
                                                                ]
                                                            },
                                                            {
                                                                "prim": "FAILWITH"
                                                            }
                                                        ],
                                                        []
                                                    ]
                                                },
                                                {
                                                    "prim": "PUSH",
                                                    "args": [
                                                        {
                                                            "prim": "mutez"
                                                        },
                                                        {
                                                            "int": "0"
                                                        }
                                                    ]
                                                }
                                            ]
                                        ]
                                    },
                                    {
                                        "prim": "TRANSFER_TOKENS"
                                    },
                                    {
                                        "prim": "DIP",
                                        "args": [
                                            [
                                                {
                                                    "prim": "NIL",
                                                    "args": [
                                                        {
                                                            "prim": "operation"
                                                        }
                                                    ]
                                                }
                                            ]
                                        ]
                                    },
                                    {
                                        "prim": "CONS"
                                    },
                                    {
                                        "prim": "DIP",
                                        "args": [
                                            [
                                                {
                                                    "prim": "UNIT"
                                                }
                                            ]
                                        ]
                                    },
                                    {
                                        "prim": "PAIR"
                                    }
                                ]
                            ]
                        },
                        "result": {
                            "status": "backtracked",
                            "storage": {
                                "prim": "Unit"
                            },
                            "consumed_gas": "77868",
                            "storage_size": "46"
                        }
                    },
                    {
                        "kind": "transaction",
                        "source": "KT1Njyz94x2pNJGh5uMhKj24VB9JsGCdkySN",
                        "nonce": 2,
                        "amount": "0",
                        "destination": "KT1U8kHUKJVcPkzjHLahLxmnXGnK1StAeNjK",
                        "parameters": {
                            "entrypoint": "getBalance",
                            "value": {
                                "prim": "Pair",
                                "args": [
                                    {
                                        "bytes": "000013687bbb1298ad36a4bdb2c5da2f126a59aac007"
                                    },
                                    {
                                        "bytes": "01b914957bcd033f5616766476cedef974cc7c2bcb00"
                                    }
                                ]
                            }
                        },
                        "result": {
                            "status": "backtracked",
                            "storage": {
                                "prim": "Pair",
                                "args": [
                                    {
                                        "int": "5118"
                                    },
                                    {
                                        "int": "1670000"
                                    }
                                ]
                            },
                            "consumed_gas": "95277",
                            "storage_size": "3007"
                        }
                    },
                    {
                        "kind": "transaction",
                        "source": "KT1U8kHUKJVcPkzjHLahLxmnXGnK1StAeNjK",
                        "nonce": 3,
                        "amount": "0",
                        "destination": "KT1RTPET3gNv6AwZey7mYzNShC5dNteVu18E",
                        "parameters": {
                            "entrypoint": "default",
                            "value": {
                                "int": "1546544"
                            }
                        },
                        "result": {
                            "status": "failed",
                            "errors": [
                                {
                                    "kind": "temporary",
                                    "id": "proto.006-PsCARTHA.michelson_v1.runtime_error",
                                    "contract_handle": "KT1RTPET3gNv6AwZey7mYzNShC5dNteVu18E",
                                    "contract_code": [
                                        {
                                            "prim": "parameter",
                                            "args": [
                                                {
                                                    "prim": "nat"
                                                }
                                            ]
                                        },
                                        {
                                            "prim": "storage",
                                            "args": [
                                                {
                                                    "prim": "unit"
                                                }
                                            ]
                                        },
                                        {
                                            "prim": "code",
                                            "args": [
                                                [
                                                    {
                                                        "prim": "FAILWITH"
                                                    }
                                                ]
                                            ]
                                        }
                                    ]
                                },
                                {
                                    "kind": "temporary",
                                    "id": "proto.006-PsCARTHA.michelson_v1.script_rejected",
                                    "location": 7,
                                    "with": {
                                        "prim": "Pair",
                                        "args": [
                                            {
                                                "int": "1546544"
                                            },
                                            {
                                                "prim": "Unit"
                                            }
                                        ]
                                    }
                                }
                            ]
                        }
                    }
                ]
            }
        }
    ]
}
