{
  "project_info": {
    "project_number": "580579479033",
    "firebase_url": "https://parkup-a6acc.firebaseio.com",
    "project_id": "parkup-a6acc",
    "storage_bucket": "parkup-a6acc.appspot.com"
  },
  "client": [
    {
      "client_info": {
        "mobilesdk_app_id": "1:580579479033:android:a82d761e57199aadcb8128",
        "android_client_info": {
          "package_name": "app.parkup"
        }
      },
      "oauth_client": [
        {
          "client_id": "580579479033-ric0uuv6soce92phv3edtk49r8k6uspv.apps.googleusercontent.com",
          "client_type": 3
        }
      ],
      "api_key": [
        {
          "current_key": "AIzaSyBO47SU8ab9gnCTmsBnv1j4SHR-w_CDlyY"
        }
      ],
      "services": {
        "appinvite_service": {
          "other_platform_oauth_client": [
            {
              "client_id": "580579479033-ric0uuv6soce92phv3edtk49r8k6uspv.apps.googleusercontent.com",
              "client_type": 3
            }
          ]
        }
      }
    }
  ],
  "configuration_version": "1"
}