<?xml version="1.0" encoding="UTF-8"?>
<svg width="463px" height="556px" viewBox="0 0 463 556" version="1.1" xmlns="http://www.w3.org/2000/svg" xmlns:xlink="http://www.w3.org/1999/xlink">
    <title>parkup_logo_black</title>
    <g id="Page-1" stroke="none" stroke-width="1" fill="none" fill-rule="evenodd">
        <g id="logop2" transform="translate(0.400000, 0.500000)" fill="#FFFFFF" fill-rule="nonzero">
            <path d="M142.6,448.4 L142.6,342.2 L151.1,350.4 C166.9,365.6 184.5,374.3 208.7,379 C218.5,380.9 242.4,381.1 253.7,379.5 C315.3,370.3 360.3,323.8 372.2,257 C374.3,244.9 374.6,216 372.7,204 C367.2,169.3 354.1,141.6 332.3,118.8 C307.3,92.7 276.8,78.9 239.3,76.9 C200.2,74.8 158.5,90 131.9,116.3 C116.3,131.7 106.9,149.2 101.4,173.2 C99.2,183 99.2,183.4 98.6,301.4 L98.1,419.7 L89.1,412.7 C49.2,381.8 19.4,336.3 7.2,287.8 C-2.4,249.7 -2.3,210.4 7.6,172.1 C30.9,81.6 107.3,14.3 201.6,1.4 C215.7,-0.6 249.5,-0.3 263.6,1.9 C316.2,10 359.7,32.3 396.7,70.1 C438.7,113 461.6,169.6 461.6,230.5 C461.6,267.4 454.3,298.9 438.2,332 C401.2,407.7 327.1,456.6 242.8,461.2 L230.7,461.8 L187,508.2 C162.9,533.6 143.1,554.5 142.9,554.5 C142.7,554.5 142.6,506.7 142.6,448.4 Z" id="Path"></path>
            <path d="M219.6,334.1 C179.9,325.7 155.5,291.3 153,240 C150.5,190 170.9,150.2 206.3,136 C224.7,128.6 247.4,128.8 266,136.5 C300.8,151 320.6,190.1 318.3,240 C316.7,273.9 306.2,299.2 286.4,316.9 C279.4,323.2 265.4,330.6 256.1,333.1 C247.9,335.3 227.8,335.8 219.6,334.1 Z" id="Path"></path>
        </g>
    </g>
</svg>