﻿# Anbennar: commented vanilla stuff

#####################################################################
# EFFECT LIST
#####################################################################
# !!! Remember to add all new effects with a short description here !!!

# on_declared_war
#
# [...]
#
# send_captured_combatant_message: Sends the specified message to a character about a combatant being captured after a battle.
# send_slain_combatant_message: Sends the specified message to a character about a combatant being slain after (or in) a battle.
# add_truce_attacker_victory_effect: Used to set truces in a CB's on_victory
# add_truce_white_peace_effect: Used to set truces in a CB's on_white_peace
# add_truce_attacker_defeat_effect: Used to set truces in a CB's on_defeat


#####################################################################
# EFFECTS
#####################################################################

on_declared_war = {
	###############################
	##### Attacker music
	###############################
	if = {
		limit = {
			exists = scope:war # silence error when building description before war exists
			scope:war = { using_holy_war_cb_trigger = yes } # going CB->war->is this war's CB a certain type->yes
		}
		scope:attacker = { play_music_cue = mx_cue_crusade_starts }
	}
	else_if = {
		limit = {
			exists = scope:war
			OR = {
				scope:attacker = { fp3_character_any_involvement_persian_struggle_trigger = yes }
				scope:defender = { fp3_character_any_involvement_persian_struggle_trigger = yes }
			}
		}
		scope:attacker = { play_music_cue = strugglewar_cue }
	}
	else_if = {
		limit = {
			exists = scope:war
			OR = {
				scope:attacker = { fp2_character_any_involvement_iberian_struggle_trigger = yes }
				scope:defender = { fp2_character_any_involvement_iberian_struggle_trigger = yes }
			}
		}
		scope:attacker = { play_music_cue = mx_IberiaWar }
	}
	else_if = {
		limit = {
			exists = scope:war
			scope:attacker = { fp1_is_norse_tribal = yes }
		}
		scope:attacker = { play_music_cue = mx_raid }
	}
	else = {
		scope:attacker = { play_music_cue = mx_cue_war_declared }
	}
	###############################
	##### Defender music
	###############################
	if = {
		limit = {
			exists = scope:war
			OR = {
				scope:attacker = { fp2_character_any_involvement_iberian_struggle_trigger = yes }
				scope:defender = { fp2_character_any_involvement_iberian_struggle_trigger = yes }
			}
		}
		scope:defender = { play_music_cue = mx_IberiaWar }
	}
	else_if = {
		limit = {
			exists = scope:war
			OR = {
				scope:attacker = { fp3_character_any_involvement_persian_struggle_trigger = yes }
				scope:defender = { fp3_character_any_involvement_persian_struggle_trigger = yes }
			}
		}
		scope:defender = { play_music_cue = strugglewar_cue }
	}
	else_if = {
		limit = {
			exists = scope:war
			scope:attacker = { fp1_is_norse_tribal = yes }
		}
		scope:defender = { play_music_cue = mx_raid }
	}

	else = {
		scope:defender = {
			play_music_cue = mx_cue_war_declared
		}
	}

	###############################
	##### Effects
	###############################

	# Breaking Truce
	if = {
		limit = {
			scope:attacker = {
				has_truce = scope:defender
			}
		}
		scope:attacker = {
			custom_description_no_bullet = {
				text = attack_breaking_truce_text
			}

			if = {
				limit = {
					NOT = { has_perk = flexible_truces_perk }
				}
				add_prestige = break_truce_prestige_loss
				add_prestige_level = break_truce_prestige_level_loss
			}
			add_character_modifier = {
				modifier = broke_truce
				years = 3
			}

			# Struggle Catalysts.
			if = {
				limit = {
					any_character_struggle = {
						involvement = involved
						activate_struggle_catalyst_secondary_character_involvement_involved_trigger = {
							CATALYST = catalyst_broke_truce_against_important_character
							CHAR = scope:defender
						}
					}
				}
				every_character_struggle = {
					involvement = involved
					limit = {
						activate_struggle_catalyst_secondary_character_involvement_involved_trigger = {
							CATALYST = catalyst_broke_truce_against_important_character
							CHAR = scope:defender
						}
					}
					activate_struggle_catalyst = {
						catalyst = catalyst_broke_truce_against_important_character
						character = scope:attacker
					}
				}
			}
		}
	}
	# Breaking Alliance
	if = {
		limit = {
			scope:attacker = {
				is_allied_to = scope:defender
			}
		}
		scope:attacker = {
			break_alliance_due_to_attack_effect = { TARGET = scope:defender }
		}
	}
	# BP2: Attacking Warden
	if = {
		limit = {
			scope:attacker = {
				any_home_court_hostage = { is_hostage_of = scope:defender }
			}
		}
		scope:attacker = {
			add_prestige = break_truce_prestige_loss
			add_prestige_level = break_truce_prestige_level_loss
			add_character_modifier = {
				modifier = attacked_warden
				years = 5
			}
			# Hostages they hold (yours)
			every_home_court_hostage = {
				save_scope_as = hostage
				every_close_family_member = {
					limit = {
						NOT = { this = scope:attacker }
					}
					custom = attacked_warden_tt
					add_opinion = {
						modifier = attacked_warden
						target = scope:attacker
					}
				}
				if = {
					limit = { is_hostage_of = scope:defender }
					custom_description_no_bullet = {
						text = attack_breaking_truce_hostage
						subject = scope:defender
						object = scope:hostage
					}
				}
			}
		}
	}
	# BP2: Attacking Home Court
	if = {
		limit = {
			scope:attacker = {
				any_warden_hostage = { is_hostage_from = scope:defender }
			}
		}
		scope:attacker = {
			# Hostages you hold (theirs)
			every_warden_hostage = {
				save_scope_as = hostage
				if = {
					limit = { is_hostage_from = scope:defender }
					custom_description_no_bullet = {
						text = attack_breaking_truce_hostage
						subject = scope:attacker
						object = scope:hostage
					}
				}
			}
			add_prestige = break_truce_prestige_loss
			add_prestige_level = break_truce_prestige_level_loss
			add_character_modifier = {
				modifier = attacked_home_court
				years = 5
			}
			# Hostages they hold (yours)
			every_home_court_hostage = {
				save_scope_as = hostage
				every_close_family_member = {
					limit = {
						NOT = { this = scope:attacker }
					}
					custom = attacked_warden_tt
					add_opinion = {
						modifier = attacked_home_court
						target = scope:attacker
					}
				}
				if = {
					limit = { is_hostage_of = scope:defender }
					custom_description_no_bullet = {
						text = attack_breaking_truce_hostage
						subject = scope:defender
						object = scope:hostage
					}
				}
			}
		}
	}

	# Opinion
	scope:defender = {
		add_opinion = {
			target = scope:attacker
			modifier = declared_war
		}
	}
	if = {
		limit = {
			NOT = {
				scope:attacker = {
					is_parent_of = scope:defender
				}
			}
		}
		if = {
			limit = {
				scope:defender = {
					has_father = yes
				}
			}
			scope:defender = {
				father = {
					add_opinion = {
						target = scope:attacker
						modifier = declared_war_on_son_daughter
					}
				}
			}
		}
		if = {
			limit = {
				scope:defender = {
					has_mother = yes
				}
			}
			scope:defender = {
				mother = {
					add_opinion = {
						target = scope:attacker
						modifier = declared_war_on_son_daughter
					}
				}
			}
		}
	}
	if = {
		limit = {
			NOT = { scope:attacker.culture = scope:defender.culture }
		}
		scope:defender.culture = {
			change_cultural_acceptance = {
				target = scope:attacker.culture
				value = declare_war_culture_acceptance_impact
				desc = cultural_acceptance_loss_declared_war
			}
		}
	}
	
	scope:attacker = {
		if = {
			limit = {
				any_vassal = {
					has_vassal_stance = parochial
				}
				eighty_percent_of_current_military_strength <= scope:defender.current_military_strength
			}
			custom_tooltip = parochial_vassal_disapproves_war
			hidden_effect = {
				every_vassal = {
					limit = {
						has_vassal_stance = parochial
					}
					add_opinion = {
						target = scope:attacker
						modifier = parochial_disapproves_strong_war_enemy_opinion
					}
				}
			}
		}
	}
	
	# If we're a clan this interaction affects unity
	add_clan_unity_interaction_effect = {
		CHARACTER = scope:attacker
		TARGET = scope:defender
		VALUE = massive_unity_loss
		DESC = clan_unity_declared_war.desc
		REVERSE_NON_HOUSE_TARGET = no
	}
}

break_alliance_due_to_attack_effect = {
	custom_description_no_bullet = { text = attack_ally_text }
	add_prestige = attack_ally_prestige_loss
	add_prestige_level = attack_ally_prestige_level_loss
	add_character_modifier = {
		modifier = attacked_ally
		years = 3
	}
	break_alliance = $TARGET$
}

conquest_cb_title_transfer = {
	save_scope_as = target_title # For the vassalization trigger.

	# Compile a list of all counties in the kingdom we will take from the defender.
	every_in_de_jure_hierarchy = {
		continue = {
			tier > tier_county
		}
		limit = {
			tier = tier_county

			# Current holder must be a (sub)vassal of the defender (no poaching titles from 3rd parties!)
			exists = holder
			holder = {
				OR = {
					this = scope:defender
					target_is_liege_or_above = scope:defender
				}
			}
		}
		add_to_list = titles_taken
	}

	# If we can take the current holder of a title as a vassal instead of siezing their land directly, do so.
	every_in_de_jure_hierarchy = {
		limit = {
			tier >= tier_county
			trigger_if = {
				limit = { $RELIGIOUS_WAR$ = yes }
				religious_cb_holder_under_target_can_be_vassalized = yes
			}
			trigger_else = {
				conquest_cb_holder_under_target_can_be_vassalized = yes
			}
		}

		# Mark this vassal as being eligible to transfer from the defender to the attacker.
		holder = {
			if = {
				limit = {
					NOT = { is_in_list = potential_vassals}
				}
				add_to_list = potential_vassals
			}
		}
	}
	ordered_in_list = {
		list = potential_vassals
		order_by = highest_held_title_tier
		max = 99
		check_range_bounds = no

		if = {
			# If a liege has already been added to the vassalization list, skip us (we will remain our liege's vassal.)
			limit = {
				save_temporary_scope_as = this_vassal
				any_in_list = {
					list = vassals_taken
					target_is_vassal_or_below = scope:this_vassal
				}
			}
		}
		else = {
			# Flag this character to be vassalized instead of usurped.
			add_to_list = vassals_taken

			# Remove the counties this vassal holds from the siezed title list (the vassal gets to keep their land when switching allegiance!)
			every_sub_realm_county = {
				remove_from_list = titles_taken
			}
		}
	}
}

struggle_cb_title_transfer = {
	save_scope_as = target_title # For the vassalization trigger.

	# Compile a list of all counties in the kingdom we will take from the defender.
	every_in_de_jure_hierarchy = {
		continue = {
			tier > tier_county
		}
		limit = {
			tier = tier_county

			# Current holder must be a (sub)vassal of the defender (no poaching titles from 3rd parties!)
			exists = holder
			holder = {
				OR = {
					this = scope:defender
					target_is_liege_or_above = scope:defender
				}
			}
		}
		add_to_list = titles_taken
	}

	every_in_list = {
		list = target_titles
		limit = {
			tier = tier_county
			exists = holder
			holder = {
				highest_held_title_tier < scope:attacker.highest_held_title_tier
				OR = {
					this = scope:defender
					target_is_liege_or_above = scope:defender
				}
				any_sub_realm_county = {
					count = all
					is_in_list = titles_taken
				}
			}
		}
		holder = {
			if = {
				limit = {
					NOT = { is_in_list = potential_vassals }
				}
				add_to_list = potential_vassals
			}
		}
	}

	ordered_in_list = {
		list = potential_vassals
		order_by = highest_held_title_tier
		max = 99
		check_range_bounds = no

		if = {
			# If a liege has already been added to the vassalization list, skip us (we will remain our liege's vassal.)
			limit = {
				save_temporary_scope_as = this_vassal
				any_in_list = {
					list = vassals_taken
					target_is_vassal_or_below = scope:this_vassal
				}
			}
		}
		else = {
			# Flag this character to be vassalized instead of usurped.
			add_to_list = vassals_taken

			# Remove the counties this vassal holds from the siezed title list (the vassal gets to keep their land when switching allegiance!)
			every_held_county = {
				remove_from_list = titles_taken
			}
			every_sub_realm_county = {
				remove_from_list = titles_taken
			}
		}
	}
}

excommunication_cb_piety_change = {

	#Amount of piety gain is scaled based on the highest tier title the defender has.
	if = {
		limit = {
			scope:defender.highest_held_title_tier = tier_empire
		}
		$WINNER$ = {
			if = {
				limit = {
					$WINNER$ = scope:attacker
				}
				add_piety = {
					add = religious_cb_piety_gain_empire
					multiply = excommunication_cb_piety_change_multiplier
				}
			}
			else = {
				add_piety = religious_cb_piety_gain_empire
			}
		}
		$LOSER$ = {
			add_piety = religious_cb_piety_loss_empire
		}
	}

	else_if = {
		limit = {
			scope:defender.highest_held_title_tier = tier_kingdom
		}
		$WINNER$ = {
			if = {
				limit = {
					$WINNER$ = scope:attacker
				}
				add_piety = {
					add = religious_cb_piety_gain_kingdom
					multiply = excommunication_cb_piety_change_multiplier
				}
			}
			else = {
				add_piety = religious_cb_piety_gain_kingdom
			}
		}
		$LOSER$ = {
			add_piety = religious_cb_piety_loss_kingdom
		}
	}
	else_if = {
		limit = {
			scope:defender.highest_held_title_tier = tier_duchy
		}
		$WINNER$ = {
			if = {
				limit = {
					$WINNER$ = scope:attacker
				}
				add_piety = {
					add = religious_cb_piety_gain_duchy
					multiply = excommunication_cb_piety_change_multiplier
				}
			}
			else = {
				add_piety = religious_cb_piety_gain_duchy
			}
		}
		$LOSER$ = {
			add_piety = religious_cb_piety_loss_duchy
		}
	}
	else = {
		$WINNER$ = {
			if = {
				limit = {
					$WINNER$ = scope:attacker
				}
				add_piety = {
					add = religious_cb_piety_gain_county
					multiply = excommunication_cb_piety_change_multiplier
				}
			}
			else = {
				add_piety = religious_cb_piety_gain_county
			}
		}
		$LOSER$ = {
			add_piety = religious_cb_piety_loss_county
		}
	}
}

on_lost_aggression_war_discontent_loss = {
	scope:loser = {
		if = {
			limit = {
				has_targeting_faction = yes
			}
			add_targeting_factions_discontent  = 25
		}
	}
}


# Imprison all faction-members (rebelling vassals if there's no faction) if they lose a revolt-war and add a revoke reason
on_lost_faction_revolt_war = {
	if = {
		limit = {
			exists = scope:attacker.joined_faction
		}
		scope:attacker.joined_faction = {
			set_variable = {
				name = peasant_destroying
				value = yes
			}
			every_faction_member = {
				if = {
					limit = {
						exists = scope:attacker.joined_faction # Can get destroyed as we loop through
					}
					leave_faction_with_cooldown_effect = {
						FACTION = scope:attacker.joined_faction
						YEARS = faction_war_defeat_cooldown
					}
				}
				else = {
					add_faction_cooldown_effect = { YEARS = faction_war_defeat_cooldown }
				}
			}
		}
	}
	war = {
		every_war_attacker = {
			limit = {
				exists = liege
				any_liege_or_above = { this = scope:defender }
			}
			if = { # Imprison them if they aren't imprisoned.
				limit = {
					is_imprisoned = no
				}
				hard_imprison_character_effect = {
					TARGET = this
					IMPRISONER = scope:defender
				}
			}
			scope:defender = {
				add_opinion = {
					target = prev
					modifier = vassal_lost_faction_revolt_war
				}
			}
			#block them from joining factions if they aren't blocked yet
			if = {
				limit = {
					NOT = { has_character_flag = joining_faction_block }
				}
				add_faction_cooldown_effect = { YEARS = faction_war_defeat_cooldown }
			}
		}
	}
}

# Imprison all revolters on lost request revolt.
on_lost_request_revolt_war = {
	war = {
		every_war_attacker = {
			limit = {
				exists = liege
				any_liege_or_above = { this = scope:defender }
			}
			if = {
				limit = { is_imprisoned = no }
				hard_imprison_character_effect = {
					TARGET = this
					IMPRISONER = scope:defender
				}
			}
			if = {
				limit = { liege = scope:defender }
				add_faction_cooldown_effect = { YEARS = faction_war_defeat_cooldown }
			}
			scope:defender = {
				add_opinion = {
					target = prev
					modifier = vassal_lost_faction_revolt_war
				}
			}
		}
	}
}

# Add revoke reason on all faction-members if they white peace a revolt-war
on_white_peace_faction_revolt_war = {
	if = {
		limit = { exists = scope:attacker.joined_faction  }
		scope:attacker.joined_faction = {
			save_scope_as = current_faction
			every_faction_member = {
				if = {
					limit = {
						exists = scope:current_faction # Can get destroyed as we loop through
					}
					leave_faction_with_cooldown_effect = {
						FACTION = scope:current_faction
						YEARS = faction_war_white_peace_cooldown
					}
				}
				else = {
					add_faction_cooldown_effect = { YEARS = faction_war_white_peace_cooldown }
				}
				scope:defender = {
					add_opinion = {
						target = prev
						modifier = vassal_wp_faction_revolt_war
					}
				}
			}
		}
		scope:current_faction ?= { add_faction_discontent = -200 }
	}
}

#Add revoke reason to all attackers if they white peace on request war.
on_white_peace_request_revolt_war = {
	war = {
		every_war_attacker = {
			limit = {
				exists = liege
				any_liege_or_above = { this = scope:defender }
			}
			scope:defender = {
				add_opinion = {
					target = prev
					modifier = vassal_wp_faction_revolt_war
				}
			}
			if = {
				limit = { liege = scope:defender }
				add_faction_cooldown_effect = { YEARS = faction_war_white_peace_cooldown }
			}
		}
	}
}

change_liege_or_become_independent = {
	$CHANGE$ = { save_scope_as = change }
	$VASSAL$ = { save_scope_as = vassal }
	scope:vassal.liege = { save_scope_as = liege }

	if = {
		limit = {
			scope:liege = {
				is_independent_ruler = yes
			}
		}
		scope:vassal = {
			becomes_independent = {
				change = scope:change
			}
		}
	}
	else = {
		scope:vassal = {
			change_liege = {
				liege = scope:liege.liege
				change = scope:change
			}
		}
	}
}

on_peasant_faction_war_win_common = {
	create_title_and_vassal_change = {
		type = conquest
		save_scope_as = change
		add_claim_on_loss = yes
	}

	setup_claim_cb = {
		titles = $TARGET_TITLES$
		attacker = $ATTACKER$
		defender = $DEFENDER$
		claimant = $CLAIMANT$
		change = scope:change
	}

	# TODO Add prestige effects based on $ATTACKER_PRESTIGE$ and $DEFENDER_PRESTIGE$
	resolve_title_and_vassal_change = scope:change
}

on_claimant_faction_war_win_common = {

	# If the claimant is the prisoner of the defender, free the claimant (it doesn't make much sense to leave the new king in the old king's dungeon)
	$CLAIMANT$ = {
		if = {
			limit = {
				is_imprisoned_by = $DEFENDER$
			}
			release_from_prison = yes
		}
	}

	# Add mutual opinion bonuses between claimant and faction members, as well as a hook on the claimant if possible.
	$ATTACKER$.joined_faction = {
		every_faction_member = {
			custom = FACTION_CLAIMANT_EVERY_FACTION_MEMBER
			limit = {
				NOT = { this = $ATTACKER$.joined_faction.special_character }
			}
			hidden_effect = {
				add_opinion = {
					modifier = claimant_faction_member_opinion
					target = $ATTACKER$.joined_faction.special_character
				}
				reverse_add_opinion = {
					modifier = claimant_faction_claimant_opinion
					target = $ATTACKER$.joined_faction.special_character
				}
			}
			if = {
				limit = {
					can_add_hook = {
						type = favor_hook
						target = $ATTACKER$.joined_faction.special_character
					}
				}
				add_hook = {
					type = favor_hook
					target = $ATTACKER$.joined_faction.special_character
				}
			}
			# Struggle boost
			# if = { # Anbennar
				# limit = {
					# culture = $ATTACKER$.joined_faction.special_character.culture
					# any_character_struggle = {
						# involvement = involved
						# has_struggle_phase_parameter = struggle_prestige_install_same_culture_claimant
					# }
				# }
				# add_prestige = major_prestige_gain
			# }
		}
	}

	# Give the claimant their new title.
	create_title_and_vassal_change = {
		type = faction_demand
		save_scope_as = change
		add_claim_on_loss = yes
	}

	every_in_list = {
		list = $TARGET_TITLES$
		add_to_list = faction_titles
		holder = {
			save_scope_as = target_holder
		}
	}
	ordered_in_list = {
		list = $TARGET_TITLES$
		position = 0
		order_by = tier
		save_scope_as = target_title
	}
	$ATTACKER$.joined_faction = {
		every_faction_county_member = {
			limit = {
				NOT = { is_in_list = faction_titles }
			}
			add_to_list = faction_titles
		}
	}

	setup_claim_cb = {
		titles = faction_titles
		attacker = $ATTACKER$
		defender = $DEFENDER$
		claimant = $CLAIMANT$
		change = scope:change
		civil_war = yes
	}

	# Ensure that the liege structure is preserved
	if = {
		limit = {
			scope:target_title.holder = { is_independent_ruler = no }
			$CLAIMANT$.primary_title.tier < scope:target_title.tier
		}
		$CLAIMANT$ = {
			change_liege = {
				liege = scope:target_title.holder.liege
				change = scope:change
			}
		}
	}

	# Preserve Grandeur
	if = {
		limit = {
			scope:target_title.holder = {
				has_royal_court = yes
			}
			$CLAIMANT$ = {
				has_royal_court = no
			}
		}
		$CLAIMANT$ = {
			set_variable = {
				name = previous_holder_grandeur_value
				value = scope:target_title.holder.court_grandeur_current
			}
			save_scope_as = claimant_scope # The CLAIMANT scope is lost after the next step, so have to save the scope here
		}
	}

	resolve_title_and_vassal_change = scope:change

	# Add Appropriate Grandeur
	if = {
		limit = { exists = scope:claimant_scope }
		scope:claimant_scope = {
			if = {
				limit = {
					exists = var:previous_holder_grandeur_value
					has_royal_court = yes
				}
				hidden_effect = {
					change_current_court_grandeur = -100 # Reset to 0
					change_current_court_grandeur = var:previous_holder_grandeur_value
					remove_variable = previous_holder_grandeur_value
				}
				change_current_court_grandeur = massive_court_grandeur_gain # Gain a bonus to Grandeur for winning a claim faction
			}
		}
	}

	# TODO Add prestige effects based on $ATTACKER_PRESTIGE$ and $DEFENDER_PRESTIGE$
}


#To release the winners prisoners when the war ends
#Needs the arguments ATTACKER and WINNER. ATTACKER is weather the attacker won or not (y/n) and WINNER is the scope of the winner.
release_prisoners_of_war_effect = {
	#Prisoners of defenders
	every_war_defender = {
		every_prisoner = {
			limit = {
				OR = {
					this = scope:war.primary_attacker
					scope:war.primary_attacker.primary_title = {
						place_in_line_of_succession = {
							target = prev
							value <= 3
						}
					}
				}
			}
			release_from_prison = yes
		}
	}
	#Prisoners of attackers
	every_war_attacker = {
		every_prisoner = {
			limit = {
				OR = {
					this = scope:war.primary_defender
					scope:war.primary_defender.primary_title = {
						place_in_line_of_succession = {
							target = prev
							value <= 3
						}
					}
				}
			}
			release_from_prison = yes
		}
	}
}


send_captured_combatant_message = {
	# The positioning of the character portraits needs to sync up with the loc-string we're using.
	if = {
		limit = {
			$IS_ENEMY_MESSAGE$ = no
		}
		root = {
			save_scope_as = right_character
		}
		scope:enemy_army_owner = {
			save_scope_as = left_character
		}
	}
	else = {
		root = {
			save_scope_as = left_character
		}
		scope:enemy_army_owner = {
			save_scope_as = right_character
		}
	}

	# Send either a toast or a message to this character, depending on what variable was passed in.
	if = {
		limit = {
			$TOAST$ = yes
		}
		send_interface_toast = {
			title = $DESC$
			left_icon = scope:left_character
			right_icon = scope:right_character
		}
	}
	else_if = {
		limit = {
			$IS_ENEMY_MESSAGE$ = no
		}
		send_interface_message = {
			type = event_war_good
			title = $TITLE$
			desc = $DESC$
			left_icon = scope:left_character
			right_icon = scope:right_character
		}
	}
	else = {
		send_interface_message = {
			type = event_war_bad
			title = $TITLE$
			desc = $DESC$
			left_icon = scope:left_character
			right_icon = scope:right_character
		}
	}
}

send_slain_combatant_message = {
	# The positioning of the character portraits needs to sync up with the loc-string we're using.
	if = {
		limit = {
			$IS_ENEMY_MESSAGE$ = no
		}
		root = {
			save_scope_as = right_character
		}
		$KILLER$ = {
			save_scope_as = left_character
		}
	}
	else = {
		root = {
			save_scope_as = left_character
		}
		$KILLER$ = {
			save_scope_as = right_character
		}
	}

	# Send either a toast or a message to this character, depending on what variable was passed in.
	if = {
		limit = {
			$TOAST$ = yes
		}
		send_interface_toast = {
			title =  $DESC$
			left_icon = scope:left_character
			right_icon = scope:right_character
		}
	}
	#
	else_if = {
		limit = {
			$IS_ENEMY_MESSAGE$ = no
		}
		send_interface_message = {
			type = event_war_good
			title = $TITLE$
			desc = $DESC$
			left_icon = scope:left_character
			right_icon = scope:right_character
		}
	}
	else = {
		send_interface_message = {
			type = event_war_bad
			title = $TITLE$
			desc = $DESC$
			left_icon = scope:left_character
			right_icon = scope:right_character
		}
	}
}

send_new_alliance_message = {
	$THIS_CHARACTER$ = {
		every_character_war = {
			limit = {
				# As a pure notification thing, we only care about players. No need to waste CPU cycles for AI-only wars.
				any_war_participant = {
					is_ai = no
				}
				# Only if we're the primary attacker or defender (non-primary participants can't call their own allies)
				OR = {
					primary_attacker = $THIS_CHARACTER$
					primary_defender = $THIS_CHARACTER$
				}
				# Don't send messages about alliances to landless courtiers (who can't actually join wars, alliance or no)
				$THIS_CHARACTER$ = { is_landed = yes }
				$OTHER_CHARACTER$ = { is_landed = yes }
			}
			save_scope_as = this_war
			$THIS_CHARACTER$ = { save_scope_as = this_character }
			$OTHER_CHARACTER$ = { save_scope_as = other_character }
			every_war_participant = {
				limit = {
					is_ai = no
					# We only want to alert people of potential new enemies
					any_war_enemy = { this = scope:this_character}
				}
				send_interface_toast = {
					title = enemy_gained_new_ally
					left_icon = scope:this_character
					right_icon = scope:other_character
					custom_tooltip = enemy_gained_new_ally_tt
				}
			}
		}
	}
}

# TRUCES
# Add attacker truce on victory
add_truce_attacker_victory_effect = {
	scope:attacker = { # Vassal Stance opinion effect
		if = {
			limit = {
				any_vassal = {
					has_vassal_stance = glory_hound
				}
			}
			custom_tooltip = glory_hound_approves_war_victory
			hidden_effect = {
				every_vassal = {
					limit = {
						has_vassal_stance = glory_hound
					}
					add_opinion = {
						target = scope:attacker
						modifier = glory_hound_approves_war_victory_opinion
					}
				}
			}
		}
		if = {
			limit = {
				government_has_flag = government_is_clan
				house ?= { has_house_unity_stage = antagonistic }	
				any_vassal = {
					house ?= scope:attacker.house
				}
			}
			custom_tooltip = antagonistic_house_approves_war_victory
			hidden_effect = {
				every_vassal = {
					limit = {
						house ?= scope:attacker.house
					}
					add_opinion = {
						target = scope:attacker
						modifier = antagonistic_house_approves_war_victory_opinion
					}
				}
			}
		}
	}
	scope:defender = { # Vassal Stance opinion effect
		if = {
			limit = {
				any_vassal = {
					has_vassal_stance = glory_hound
				}
			}
			custom_tooltip = glory_hound_disapproves_war_defeat_defender
			hidden_effect = {
				every_vassal = {
					limit = {
						has_vassal_stance = glory_hound
					}
					add_opinion = {
						target = scope:defender
						modifier = glory_hound_disapproves_war_defeat_opinion
					}
				}
			}
		}
		if = {
			limit = {
				government_has_flag = government_is_clan
				house ?= { has_house_unity_stage = antagonistic }	
				any_vassal = {
					house ?= scope:defender.house
				}
			}
			custom_tooltip = antagonistic_house_disapproves_war_defeat_defender
			hidden_effect = {
				every_vassal = {
					limit = {
						house ?= scope:defender.house
					}
					add_opinion = {
						target = scope:defender
						modifier = antagonistic_house_disapproves_war_defeat_opinion
					}
				}
			}
		}
	}
	hidden_effect = {
		scope:attacker = {
			add_truce_one_way = {
				character = scope:defender
				days = standard_truce_duration_days
				war = root.war
				result = victory
			}
		}
	}
	scope:attacker = {
		if = {
			limit = {
				existing_feud_against_target_trigger = { TARGET = scope:defender }
			}
			house.house_head = {
				random_owned_story = {
					limit = { story_type = story_cycle_house_feud }
					change_variable = {
						name = house_feud_kill_counter
						add = house_feud_medium_counter_value
					}
				}
			}
			house = {
				every_house_member = {
					limit = { is_ai = no }
					send_interface_message = {
						type = house_feud_victory_message
						left_icon = scope:attacker
						right_icon = scope:defender
						custom_tooltip = house_feud_tipped_scales_pos_medium
					}
				}
			}
		}
	}
	scope:defender = {
		if = {
			limit = {
				existing_feud_against_target_trigger = { TARGET = scope:attacker }
			}
			house.house_head = {
				random_owned_story = {
					limit = { story_type = story_cycle_house_feud }
					change_variable = {
						name = house_feud_death_counter
						add = house_feud_medium_counter_value
					}
				}
			}
			house = {
				every_house_member = {
					limit = { is_ai = no }
					send_interface_message = {
						type = house_feud_defeat_message
						left_icon = scope:defender
						right_icon = scope:attacker
						custom_tooltip = house_feud_tipped_scales_neg_medium
					}
				}
			}
		}
	}
	# Tooltips for hostage exchange, handled here as it's shared between casus belli
	bp2_hostage_war_end_tooltip_effect = yes
}

# Add white peace truce
add_truce_white_peace_effect = {
	scope:attacker = { # Vassal Stance opinion effect
		if = {
			limit = {
				any_vassal = {
					has_vassal_stance = glory_hound
				}
			}
			custom_tooltip = glory_hound_disapproves_war_white_peace
			hidden_effect = {
				every_vassal = {
					limit = {
						has_vassal_stance = glory_hound
					}
					add_opinion = {
						target = scope:attacker
						modifier = glory_hound_disapproves_war_white_peace_opinion
					}
				}
			}
		}
		if = {
			limit = {
				government_has_flag = government_is_clan
				house ?= { has_house_unity_stage = antagonistic }	
				any_vassal = {
					house ?= scope:attacker.house
				}
			}
			custom_tooltip = antagonistic_house_disapproves_war_white_peace
			hidden_effect = {
				every_vassal = {
					limit = {
						house ?= scope:attacker.house
					}
					add_opinion = {
						target = scope:attacker
						modifier = antagonistic_house_disapproves_war_white_peace_opinion
					}
				}
			}
		}
		if = {
			limit = {
				any_active_accolade = {
					has_accolade_parameter = accolade_champions_white_peace
				}
			}
			add_prestige = accolade_white_peace_prestige_value
		}
	}
	scope:defender = { # Vassal Stance opinion effect
		if = {
			limit = {
				any_vassal = {
					has_vassal_stance = glory_hound
				}
			}
			custom_tooltip = glory_hound_disapproves_war_white_peace_defender
			hidden_effect = {
				every_vassal = {
					limit = {
						has_vassal_stance = glory_hound
					}
					add_opinion = {
						target = scope:defender
						modifier = glory_hound_disapproves_war_white_peace_opinion
					}
				}
			}
		}
		if = {
			limit = {
				government_has_flag = government_is_clan
				house ?= { has_house_unity_stage = antagonistic }	
				any_vassal = {
					house ?= scope:defender.house
				}
			}
			custom_tooltip = antagonistic_house_disapproves_war_white_peace_defender
			hidden_effect = {
				every_vassal = {
					limit = {
						house ?= scope:defender.house
					}
					add_opinion = {
						target = scope:defender
						modifier = antagonistic_house_disapproves_war_white_peace_opinion
					}
				}
			}
		}
	}
	hidden_effect = {
		scope:attacker = {
			add_truce_one_way = {
				character = scope:defender
				days = standard_truce_duration_days
				war = root.war
				result = white_peace
			}
		}
	}
	scope:attacker = {
		if = {
			limit = {
				existing_feud_against_target_trigger = { TARGET = scope:defender }
			}
			house = {
				every_house_member = {
					limit = { is_ai = no }
					send_interface_message = {
						type = house_feud_white_peace_message
						left_icon = scope:attacker
						right_icon = scope:defender
						title = msg_house_feud_white_peace
						desc = msg_house_feud_white_peace_desc
					}
				}
			}
		}
	}
	scope:defender = {
		if = {
			limit = {
				existing_feud_against_target_trigger = { TARGET = scope:attacker }
			}
			house = {
				every_house_member = {
					limit = { is_ai = no }
					send_interface_message = {
						type = house_feud_white_peace_message
						left_icon = scope:defender
						right_icon = scope:attacker
						title = msg_house_feud_white_peace
						desc = msg_house_feud_white_peace_desc
					}
				}
			}
		}
	}
	# Tooltips for hostage exchange, handled here as it's shared between casus belli
	bp2_hostage_war_end_tooltip_effect = yes
}

# Add attacker truce on defeat
add_truce_attacker_defeat_effect = {
	scope:attacker = { # Vassal Stance opinion effect
		if = {
			limit = {
				any_vassal = {
					has_vassal_stance = glory_hound
				}
			}
			custom_tooltip = glory_hound_disapproves_war_defeat
			hidden_effect = {
				every_vassal = {
					limit = {
						has_vassal_stance = glory_hound
					}
					add_opinion = {
						target = scope:attacker
						modifier = glory_hound_disapproves_war_defeat_opinion
					}
				}
			}
		}
		if = {
			limit = {
				government_has_flag = government_is_clan
				house ?= { has_house_unity_stage = antagonistic }	
				any_vassal = {
					house ?= scope:attacker.house
				}
			}
			custom_tooltip = antagonistic_house_disapproves_war_defeat
			hidden_effect = {
				every_vassal = {
					limit = {
						house ?= scope:attacker.house
					}
					add_opinion = {
						target = scope:attacker
						modifier = antagonistic_house_disapproves_war_defeat_opinion
					}
				}
			}
		}
	}
	hidden_effect = {
		scope:attacker = {
			add_truce_one_way = {
				character = scope:defender
				days = standard_truce_duration_days
				war = root.war
				result = defeat
			}
		}
	}
	scope:attacker = {
		if = {
			limit = {
				existing_feud_against_target_trigger = { TARGET = scope:defender }
			}
			house.house_head = {
				random_owned_story = {
					limit = { story_type = story_cycle_house_feud }
					change_variable = {
						name = house_feud_death_counter
						add = house_feud_medium_counter_value
					}
				}
			}
			house = {
				every_house_member = {
					limit = { is_ai = no }
					send_interface_message = {
						type = house_feud_defeat_message
						left_icon = scope:attacker
						right_icon = scope:defender
						title = msg_house_feud_defeat
						desc = msg_house_feud_defeat_desc
						custom_tooltip = house_feud_tipped_scales_neg_medium
					}
				}
			}
		}
	}
	scope:defender = {
		if = {
			limit = {
				existing_feud_against_target_trigger = { TARGET = scope:attacker }
			}
			house.house_head = {
				random_owned_story = {
					limit = { story_type = story_cycle_house_feud }
					change_variable = {
						name = house_feud_kill_counter
						add = house_feud_medium_counter_value
					}
				}
			}
			house = {
				every_house_member = {
					limit = { is_ai = no }
					send_interface_message = {
						type = house_feud_victory_message
						left_icon = scope:defender
						right_icon = scope:attacker
						title = msg_house_feud_victory
						desc = msg_house_feud_victory_desc
					}
				}
			}
		}
		
		if = {
			limit = {
				government_has_flag = government_is_clan
				house ?= { has_house_unity_stage = antagonistic }
				any_vassal = {
					house ?= scope:defender.house
				}
			}
			custom_tooltip = antagonistic_house_approves_war_victory_defensive
			hidden_effect = {
				every_vassal = {
					limit = {
						house ?= scope:defender.house
					}
					add_opinion = {
						target = scope:defender
						modifier = antagonistic_house_approves_war_victory_defensive_opinion
					}
				}
			}
		}
	}
	# Tooltips for hostage exchange, handled here as it's shared between casus belli
	bp2_hostage_war_end_tooltip_effect = yes
}

# Add GHW truces on attacker victory.
add_truce_GHW_attacker_victory_effect = {
	hidden_effect = {
		scope:attacker.faith.great_holy_war = {
			every_pledged_defender = {
				add_truce_both_ways = {
					character = scope:title_recipient
					days = 3650
					war = root.war
					result = defeat
				}
			}
		}
	}
}

# Force a white peace on any forced.
force_truce_GHW_defenders_effect = {
	hidden_effect = {
		#if any defender
			#owns lands in target kingdom
			#is primary in war with another defender who
				#owns land in target kingdom
				#is also a primary
			#then end that war with a white peace
		scope:the_ghw = {
			every_pledged_defender = {
				save_temporary_scope_as = white_peace_attacker
				every_character_war = {
					if = {
						limit = {
							primary_attacker = scope:white_peace_attacker
							primary_defender = {
								save_temporary_scope_as = white_peace_defender
								OR = {
									scope:the_ghw = { has_forced_defender = scope:white_peace_defender }
									AND = {
										scope:target_kingdom = {
											any_de_jure_county_holder = {
												OR = {
													this = scope:white_peace_defender
													any_liege_or_above = { this = scope:white_peace_defender }
												}
											}
										}
										top_liege = {
											save_temporary_scope_as = white_peace_liege
											scope:the_ghw = { has_forced_defender = scope:white_peace_liege }
										}
									}
								}
							}
						}
						end_war = white_peace
					}
				}
			}
		}
	}
}

notify_players_about_neighboring_war_resolution_effect = {
	every_player = {
		limit = {
			NOT = { is_participant_in_war = scope:war}
		}
		save_scope_as = this_player

		# Checks if this player should be notified at all about the war resolution (e.g., either attacker or defender are neighbors).
		if = {
			limit = {
				should_notify_player_about_neighboring_rulers_wars_trigger = { TARGET_CHARACTER = scope:winner }

				# Only notify about revolts if rebels win
				trigger_if = {
					limit = {
						scope:war = {
							OR = {
								using_cb = peasant_war
								using_cb = independence_faction_war
								using_cb = liberty_faction_war
								using_cb = populist_war
								using_cb = depose_war
								using_cb = claimant_faction_war
							}
						}
					}
					scope:winner = scope:attacker
				}
			}

			# Check which type of message we need to send to the player.
			if = {
				limit = {
					always = yes
					should_notify_player_about_neighboring_rulers_wars_trigger = { TARGET_CHARACTER = scope:loser }
				}
				# Send combined message about both the winner and the loser.
				send_interface_message = {
					type = event_siege_lost_bad
					left_icon = scope:winner
					right_icon = scope:loser
					title = war_event.neighbor_war.both_neighbors.t
					desc = war_event.neighbor_war.both_neighbors.desc
				}
			}
			else = {
				# Send message only about the winner.
				send_interface_message = {
					type = event_siege_lost_bad
					left_icon = scope:winner
					right_icon = scope:loser
					title = war_event.neighbor_war.only_winner.t
					desc = war_event.neighbor_war.only_winner.desc
				}
			}
		}
		else_if = {
			limit = {
				should_notify_player_about_neighboring_rulers_wars_trigger = { TARGET_CHARACTER = scope:loser }

				# Only notify about revolts if rebels win
				trigger_if = {
					limit = {
						scope:war = {
							OR = {
								using_cb = peasant_war
								using_cb = independence_faction_war
								using_cb = liberty_faction_war
								using_cb = populist_war
								using_cb = depose_war
								using_cb = claimant_faction_war
							}
						}
					}
					scope:winner = scope:attacker
				}
			}

			# Send message only about the loser.
			send_interface_message = {
				type = event_siege_lost_bad
				left_icon = scope:loser
				right_icon = scope:winner
				title = war_event.neighbor_war.only_loser.t
				desc = war_event.neighbor_war.only_loser.desc
			}
		}
	}
}

show_pow_release_message_effect = {
	if = {
		limit = {
			any_character_war = {
				primary_attacker = scope:attacker
				primary_defender = scope:defender
			}
		}
		every_character_war = {
			limit = {
				primary_attacker = scope:attacker
				primary_defender = scope:defender
			}
			save_scope_as = war
		}
		if = {
			limit = { prisoners_of_war_trigger = yes }
			custom_tooltip = release_pow_at_end_of_war
		}
	}
}

add_prestige_war_defender_effect = {
	add_prestige = {
		value = $PRESTIGE_VALUE$
		if = {
			limit= {
				scope:defender.culture = {
					has_cultural_parameter = more_fame_for_successful_defensive_wars
				}
			}
			multiply = 2
		}
	}
}

pay_short_term_gold_reparations_effect = {
	pay_short_term_gold = {
		gold = {
			value = $GOLD_VALUE$
			if = {
				limit= {
					scope:defender.culture = {
						has_cultural_parameter = more_gold_for_successful_defensive_wars
					}
				}
				multiply = 2
			}
		}
		target = scope:defender
		yearly_income = yes
	}
}


# mongol_invasion_county_looting_chance_effect = { # Anbennar
	# save_temporary_scope_as = county
	# if = {
		# limit = {
			# NOR = {
				# exists = var:looted_by_mongols
				# holder = scope:attacker
			# }
		# }
		# random = {
			# chance = scope:attacker.martial
			# # Each County should only be devastated once
			# set_variable = {
				# name = looted_by_mongols
				# value = yes
			# }
			# # Send a message (and gold!) to the Mongol Emperor
			# scope:attacker = {
				# send_interface_message = {
					# type = mongol_occupation_good
					# title = mongols_sieged_county.t
					# left_icon = scope:county.holder
					# right_icon = scope:county
					# add_gold = {
						# add = scope:county.development_level
						# multiply = 5
					# }
					# if = {
						# limit = { dread < 100 }
						# add_dread = 2
					# }
				# }
				# save_scope_as = mongol_emperor
				# # Send a message to the County's owner
				# scope:county.holder = {
					# send_interface_message = {
						# type = mongol_occupation_bad
						# title = mongols_sieged_county.t
						# left_icon = scope:mongol_emperor
						# right_icon = scope:county
						# scope:county = { mongols_devastate_county_effect = yes }
					# }
				# }
			# }
		# }
	# }
# }
