#
# A fatal error has been detected by the Java Runtime Environment:
#
#  EXCEPTION_ACCESS_VIOLATION (0xc0000005) at pc=0x0000000023e41066, pid=34248, tid=0x000000000000082c
#
# JRE version: Java(TM) SE Runtime Environment (8.0_161-b12) (build 1.8.0_161-b12)
# Java VM: Java HotSpot(TM) 64-Bit Server VM (25.161-b12 mixed mode windows-amd64 compressed oops)
# Problematic frame:
# C  [OpenAL64.dll+0x11066]
#
# Failed to write core dump. Minidumps are not enabled by default on client versions of Windows
#
# If you would like to submit a bug report, please visit:
#   http://bugreport.java.com/bugreport/crash.jsp
# The crash happened outside the Java Virtual Machine in native code.
# See problematic frame for where to report the bug.
#

---------------  T H R E A D  ---------------

Current thread (0x00000000216a6800):  JavaThread "Thread-10" [_thread_in_native, id=2092, stack(0x0000000038db0000,0x0000000038eb0000)]

siginfo: ExceptionCode=0xc0000005, reading address 0x0000000023aeb004

Registers:
RAX=0x0000000000000004, RBX=0x000000003e330090, RCX=0x0000000023aeb008, RDX=0x0000000023aeb004
RSP=0x0000000038eaec90, RBP=0x00000000000000ff, RSI=0x0000000023ae846c, RDI=0x0000000000000000
R8 =0x0000000000000ae6, R9 =0x0000000023ae846c, R10=0x00000000029885fb, R11=0x000000007760bcb0
R12=0x0000000000000001, R13=0x000000003dd70308, R14=0x0000000038eaee28, R15=0x00000000216a6800
RIP=0x0000000023e41066, EFLAGS=0x0000000000010202

Top of Stack: (sp=0x0000000038eaec90)
0x0000000038eaec90:   0000000000000000 00000000774ad5cb
0x0000000038eaeca0:   00000000216a6800 00000000216a6800
0x0000000038eaecb0:   000000003dd70308 0000000000000000
0x0000000038eaecc0:   00000000216a6800 00000000233bfc10
0x0000000038eaecd0:   000000003dd70308 0000000038eaee28
0x0000000038eaece0:   0000000024b07280 000000007749b936
0x0000000038eaecf0:   0000000038eaf498 0000000025161040
0x0000000038eaed00:   00000000216a6800 0000000038eaee28
0x0000000038eaed10:   000000003dd70308 0000000000000000
0x0000000038eaed20:   0000000023ae846c 00000006c0556480
0x0000000038eaed30:   0000000038eaedf0 0000000023e4248f
0x0000000038eaed40:   000000003e330090 000000003e330090
0x0000000038eaed50:   000000000000ac44 0000000600000004
0x0000000038eaed60:   0000000000000010 0000000002988627
0x0000000038eaed70:   000000003dd70308 000000000298835d
0x0000000038eaed80:   00000000216a6800 000000003dd70308 

Instructions: (pc=0x0000000023e41066)
0x0000000023e41046:   41 2b ec 81 3a 03 00 02 00 75 09 8b 01 89 84 24
0x0000000023e41056:   c8 00 00 00 49 83 c0 02 48 83 c1 08 4a 8d 14 86
0x0000000023e41066:   39 3a 75 af 4c 8d 84 24 c0 00 00 00 48 8d 15 d7
0x0000000023e41076:   2b 03 00 33 c9 e8 58 5f 00 00 b8 40 1f 00 00 4c 


Register to memory mapping:

RAX=0x0000000000000004 is an unknown value
RBX=0x000000003e330090 is an unknown value
RCX=0x0000000023aeb008 is an unknown value
RDX=0x0000000023aeb004 is an unknown value
RSP=0x0000000038eaec90 is pointing into the stack for thread: 0x00000000216a6800
RBP=0x00000000000000ff is an unknown value
RSI=0x0000000023ae846c is an unknown value
RDI=0x0000000000000000 is an unknown value
R8 =0x0000000000000ae6 is an unknown value
R9 =0x0000000023ae846c is an unknown value
R10=0x00000000029885fb is at code_begin+891 in an Interpreter codelet
method entry point (kind = native)  [0x0000000002988280, 0x0000000002988c40]  2496 bytes
R11=0x000000007760bcb0 is an unknown value
R12=0x0000000000000001 is an unknown value
R13={method} {0x000000003dd70310} 'nalcCreateContext' '(JJ)J' in 'org/lwjgl/openal/ALC10'
R14=0x0000000038eaee28 is pointing into the stack for thread: 0x00000000216a6800
R15=0x00000000216a6800 is a thread


Stack: [0x0000000038db0000,0x0000000038eb0000],  sp=0x0000000038eaec90,  free space=1019k
Native frames: (J=compiled Java code, j=interpreted, Vv=VM code, C=native code)
C  [OpenAL64.dll+0x11066]
C  [OpenAL64.dll+0x1248f]
C  0x0000000002988627

Java frames: (J=compiled Java code, j=interpreted, Vv=VM code)
j  org.lwjgl.openal.ALC10.nalcCreateContext(JJ)J+0
j  org.lwjgl.openal.ALC10.alcCreateContext(Lorg/lwjgl/openal/ALCdevice;Ljava/nio/IntBuffer;)Lorg/lwjgl/openal/ALCcontext;+8
j  org.lwjgl.openal.AL.init(Ljava/lang/String;IIZZ)V+69
j  org.lwjgl.openal.AL.create(Ljava/lang/String;IIZZ)V+246
j  org.lwjgl.openal.AL.create(Ljava/lang/String;IIZ)V+5
j  org.lwjgl.openal.AL.create()V+6
j  paulscode.sound.libraries.LibraryLWJGLOpenAL.init()V+2
j  paulscode.sound.SoundSystem.CommandNewLibrary(Ljava/lang/Class;)V+273
j  paulscode.sound.SoundSystem.CommandQueue(Lpaulscode/sound/CommandObject;)Z+1206
j  paulscode.sound.CommandThread.run()V+51
v  ~StubRoutines::call_stub

---------------  P R O C E S S  ---------------

Java Threads: ( => current thread )
  0x00000000216a5800 JavaThread "Thread-11" [_thread_blocked, id=37992, stack(0x000000003df50000,0x000000003e050000)]
=>0x00000000216a6800 JavaThread "Thread-10" [_thread_in_native, id=2092, stack(0x0000000038db0000,0x0000000038eb0000)]
  0x00000000216a3800 JavaThread "IC2 audio init thread" daemon [_thread_blocked, id=14596, stack(0x00000000355b0000,0x00000000356b0000)]
  0x00000000216a2800 JavaThread "Sound Library Loader" [_thread_blocked, id=37780, stack(0x0000000000d50000,0x0000000000e50000)]
  0x0000000021507800 JavaThread "Keep-Alive-Timer" daemon [_thread_blocked, id=36820, stack(0x00000000368b0000,0x00000000369b0000)]
  0x0000000021502800 JavaThread "Thread-7" [_thread_blocked, id=34356, stack(0x00000000352b0000,0x00000000353b0000)]
  0x0000000021509800 JavaThread "Thread-6" [_thread_blocked, id=37160, stack(0x0000000034fb0000,0x00000000350b0000)]
  0x0000000021506000 JavaThread "File IO Thread" [_thread_blocked, id=34700, stack(0x000000002f7a0000,0x000000002f8a0000)]
  0x0000000023ab6000 JavaThread "LWJGL Timer" daemon [_thread_blocked, id=38784, stack(0x0000000034cb0000,0x0000000034db0000)]
  0x0000000023ab1800 JavaThread "Thread-3" [_thread_blocked, id=36344, stack(0x00000000325b0000,0x00000000326b0000)]
  0x0000000023ab4800 JavaThread "Java2D Disposer" daemon [_thread_blocked, id=39256, stack(0x0000000027b10000,0x0000000027c10000)]
  0x0000000023ab0800 JavaThread "Timer hack thread" daemon [_thread_blocked, id=38484, stack(0x0000000022aa0000,0x0000000022ba0000)]
  0x0000000020116800 JavaThread "Snooper Timer" daemon [_thread_blocked, id=11760, stack(0x0000000022790000,0x0000000022890000)]
  0x000000001e445800 JavaThread "Service Thread" daemon [_thread_blocked, id=39880, stack(0x000000001ef70000,0x000000001f070000)]
  0x000000001e3b5000 JavaThread "C1 CompilerThread3" daemon [_thread_in_vm, id=9180, stack(0x000000001ee70000,0x000000001ef70000)]
  0x000000001e3b1000 JavaThread "C2 CompilerThread2" daemon [_thread_blocked, id=38964, stack(0x000000001ed70000,0x000000001ee70000)]
  0x000000001e3a4800 JavaThread "C2 CompilerThread1" daemon [_thread_in_native, id=39560, stack(0x000000001ec70000,0x000000001ed70000)]
  0x000000001e3a1000 JavaThread "C2 CompilerThread0" daemon [_thread_blocked, id=37164, stack(0x000000001eb70000,0x000000001ec70000)]
  0x000000001e39f000 JavaThread "Attach Listener" daemon [_thread_blocked, id=38768, stack(0x000000001ea70000,0x000000001eb70000)]
  0x000000001e39e000 JavaThread "Signal Dispatcher" daemon [_thread_blocked, id=39132, stack(0x000000001e970000,0x000000001ea70000)]
  0x000000001e390800 JavaThread "Finalizer" daemon [_thread_blocked, id=38752, stack(0x000000001e770000,0x000000001e870000)]
  0x000000000296b000 JavaThread "Reference Handler" daemon [_thread_blocked, id=25112, stack(0x000000001e270000,0x000000001e370000)]
  0x0000000002874800 JavaThread "Client thread" [_thread_in_native, id=39500, stack(0x0000000002770000,0x0000000002870000)]

Other Threads:
  0x000000001c487800 VMThread [stack: 0x000000001e170000,0x000000001e270000] [id=39864]
  0x000000001e45f800 WatcherThread [stack: 0x000000001f070000,0x000000001f170000] [id=38340]

VM state:not at safepoint (normal execution)

VM Mutex/Monitor currently owned by a thread: None

Heap:
 PSYoungGen      total 1178624K, used 134924K [0x000000076ab00000, 0x00000007c0000000, 0x00000007c0000000)
  eden space 997376K, 2% used [0x000000076ab00000,0x000000076c040dd0,0x00000007a7900000)
  from space 181248K, 62% used [0x00000007a7900000,0x00000007ae7823b8,0x00000007b2a00000)
  to   space 189440K, 0% used [0x00000007b4700000,0x00000007b4700000,0x00000007c0000000)
 ParOldGen       total 1595904K, used 760284K [0x00000006c0000000, 0x0000000721680000, 0x000000076ab00000)
  object space 1595904K, 47% used [0x00000006c0000000,0x00000006ee677208,0x0000000721680000)
 Metaspace       used 190533K, capacity 205066K, committed 205352K, reserved 1210368K
  class space    used 36070K, capacity 45297K, committed 45352K, reserved 1048576K

Card table byte_map: [0x0000000011d30000,0x0000000012540000] byte_map_base: 0x000000000e730000

Marking Bits: (ParMarkBitMap*) 0x0000000077bff860
 Begin Bits: [0x00000000132a0000, 0x00000000172a0000)
 End Bits:   [0x00000000172a0000, 0x000000001b2a0000)

Polling page: 0x0000000000a20000

CodeCache: size=245760Kb used=33893Kb max_used=34282Kb free=211866Kb
 bounds [0x0000000002970000, 0x0000000004b20000, 0x0000000011970000]
 total_blobs=10724 nmethods=9521 adapters=1115
 compilation: enabled

Compilation events (10 events):
Event: 93.036 Thread 0x000000001e3b5000 13635       3       java.util.Arrays::fill (28 bytes)
Event: 93.036 Thread 0x000000001e3b5000 nmethod 13635 0x00000000048c5e90 code [0x00000000048c6020, 0x00000000048c63a8]
Event: 93.085 Thread 0x000000001e3b5000 13636  s    3       javax.imageio.stream.MemoryCacheImageInputStream$StreamDisposerRecord::dispose (20 bytes)
Event: 93.086 Thread 0x000000001e3b5000 nmethod 13636 0x00000000048c5710 code [0x00000000048c5880, 0x00000000048c5d08]
Event: 93.100 Thread 0x000000001e3b5000 13637       3       java.util.EnumMap$EnumMapIterator::hasNext (64 bytes)
Event: 93.100 Thread 0x000000001e3b5000 nmethod 13637 0x0000000002ad0c10 code [0x0000000002ad0d80, 0x0000000002ad1090]
Event: 93.103 Thread 0x000000001e3a1000 13638       4       com.google.common.collect.ImmutableSet::builder (8 bytes)
Event: 93.103 Thread 0x000000001e3b1000 13639       4       com.google.common.collect.ImmutableSet$Builder::build (22 bytes)
Event: 93.104 Thread 0x000000001e3b5000 13640   !   3       net.minecraftforge.client.model.ModelLoaderRegistry::getModel (698 bytes)
Event: 93.105 Thread 0x000000001e3a1000 nmethod 13638 0x0000000002cd2050 code [0x0000000002cd21a0, 0x0000000002cd22d8]

GC Heap History (10 events):
Event: 81.148 GC heap before
{Heap before GC invocations=40 (full 5):
 PSYoungGen      total 1158144K, used 1040402K [0x000000076ab00000, 0x00000007bdf00000, 0x00000007c0000000)
  eden space 980992K, 100% used [0x000000076ab00000,0x00000007a6900000,0x00000007a6900000)
  from space 177152K, 33% used [0x00000007b3200000,0x00000007b6c04810,0x00000007bdf00000)
  to   space 191488K, 0% used [0x00000007a6900000,0x00000007a6900000,0x00000007b2400000)
 ParOldGen       total 1595904K, used 574243K [0x00000006c0000000, 0x0000000721680000, 0x000000076ab00000)
  object space 1595904K, 35% used [0x00000006c0000000,0x00000006e30c8f78,0x0000000721680000)
 Metaspace       used 166177K, capacity 179814K, committed 180136K, reserved 1189888K
  class space    used 31251K, capacity 40010K, committed 40104K, reserved 1048576K
Event: 81.221 GC heap after
Heap after GC invocations=40 (full 5):
 PSYoungGen      total 1172480K, used 146596K [0x000000076ab00000, 0x00000007c0000000, 0x00000007c0000000)
  eden space 980992K, 0% used [0x000000076ab00000,0x000000076ab00000,0x00000007a6900000)
  from space 191488K, 76% used [0x00000007a6900000,0x00000007af8292c0,0x00000007b2400000)
  to   space 211456K, 0% used [0x00000007b3180000,0x00000007b3180000,0x00000007c0000000)
 ParOldGen       total 1595904K, used 602512K [0x00000006c0000000, 0x0000000721680000, 0x000000076ab00000)
  object space 1595904K, 37% used [0x00000006c0000000,0x00000006e4c640e8,0x0000000721680000)
 Metaspace       used 166177K, capacity 179814K, committed 180136K, reserved 1189888K
  class space    used 31251K, capacity 40010K, committed 40104K, reserved 1048576K
}
Event: 83.879 GC heap before
{Heap before GC invocations=41 (full 5):
 PSYoungGen      total 1172480K, used 1127588K [0x000000076ab00000, 0x00000007c0000000, 0x00000007c0000000)
  eden space 980992K, 100% used [0x000000076ab00000,0x00000007a6900000,0x00000007a6900000)
  from space 191488K, 76% used [0x00000007a6900000,0x00000007af8292c0,0x00000007b2400000)
  to   space 211456K, 0% used [0x00000007b3180000,0x00000007b3180000,0x00000007c0000000)
 ParOldGen       total 1595904K, used 602512K [0x00000006c0000000, 0x0000000721680000, 0x000000076ab00000)
  object space 1595904K, 37% used [0x00000006c0000000,0x00000006e4c640e8,0x0000000721680000)
 Metaspace       used 172484K, capacity 186318K, committed 186792K, reserved 1193984K
  class space    used 32448K, capacity 41360K, committed 41384K, reserved 1048576K
Event: 83.973 GC heap after
Heap after GC invocations=41 (full 5):
 PSYoungGen      total 1195520K, used 34018K [0x000000076ab00000, 0x00000007c0000000, 0x00000007c0000000)
  eden space 984064K, 0% used [0x000000076ab00000,0x000000076ab00000,0x00000007a6c00000)
  from space 211456K, 16% used [0x00000007b3180000,0x00000007b52b88c0,0x00000007c0000000)
  to   space 202240K, 0% used [0x00000007a6c00000,0x00000007a6c00000,0x00000007b3180000)
 ParOldGen       total 1595904K, used 739732K [0x00000006c0000000, 0x0000000721680000, 0x000000076ab00000)
  object space 1595904K, 46% used [0x00000006c0000000,0x00000006ed2653c0,0x0000000721680000)
 Metaspace       used 172484K, capacity 186318K, committed 186792K, reserved 1193984K
  class space    used 32448K, capacity 41360K, committed 41384K, reserved 1048576K
}
Event: 86.335 GC heap before
{Heap before GC invocations=42 (full 5):
 PSYoungGen      total 1195520K, used 1018082K [0x000000076ab00000, 0x00000007c0000000, 0x00000007c0000000)
  eden space 984064K, 100% used [0x000000076ab00000,0x00000007a6c00000,0x00000007a6c00000)
  from space 211456K, 16% used [0x00000007b3180000,0x00000007b52b88c0,0x00000007c0000000)
  to   space 202240K, 0% used [0x00000007a6c00000,0x00000007a6c00000,0x00000007b3180000)
 ParOldGen       total 1595904K, used 739732K [0x00000006c0000000, 0x0000000721680000, 0x000000076ab00000)
  object space 1595904K, 46% used [0x00000006c0000000,0x00000006ed2653c0,0x0000000721680000)
 Metaspace       used 179090K, capacity 193084K, committed 193576K, reserved 1200128K
  class space    used 33992K, capacity 43001K, committed 43048K, reserved 1048576K
Event: 86.357 GC heap after
Heap after GC invocations=42 (full 5):
 PSYoungGen      total 1008128K, used 23954K [0x000000076ab00000, 0x00000007be800000, 0x00000007c0000000)
  eden space 984064K, 0% used [0x000000076ab00000,0x000000076ab00000,0x00000007a6c00000)
  from space 24064K, 99% used [0x00000007a6c00000,0x00000007a83649a8,0x00000007a8380000)
  to   space 194560K, 0% used [0x00000007b2a00000,0x00000007b2a00000,0x00000007be800000)
 ParOldGen       total 1595904K, used 760268K [0x00000006c0000000, 0x0000000721680000, 0x000000076ab00000)
  object space 1595904K, 47% used [0x00000006c0000000,0x00000006ee673208,0x0000000721680000)
 Metaspace       used 179090K, capacity 193084K, committed 193576K, reserved 1200128K
  class space    used 33992K, capacity 43001K, committed 43048K, reserved 1048576K
}
Event: 89.202 GC heap before
{Heap before GC invocations=43 (full 5):
 PSYoungGen      total 1008128K, used 1008018K [0x000000076ab00000, 0x00000007be800000, 0x00000007c0000000)
  eden space 984064K, 100% used [0x000000076ab00000,0x00000007a6c00000,0x00000007a6c00000)
  from space 24064K, 99% used [0x00000007a6c00000,0x00000007a83649a8,0x00000007a8380000)
  to   space 194560K, 0% used [0x00000007b2a00000,0x00000007b2a00000,0x00000007be800000)
 ParOldGen       total 1595904K, used 760268K [0x00000006c0000000, 0x0000000721680000, 0x000000076ab00000)
  object space 1595904K, 47% used [0x00000006c0000000,0x00000006ee673208,0x0000000721680000)
 Metaspace       used 185042K, capacity 199400K, committed 199976K, reserved 1204224K
  class space    used 35075K, capacity 44202K, committed 44328K, reserved 1048576K
Event: 89.244 GC heap after
Heap after GC invocations=43 (full 5):
 PSYoungGen      total 1191936K, used 57945K [0x000000076ab00000, 0x00000007c0000000, 0x00000007c0000000)
  eden space 997376K, 0% used [0x000000076ab00000,0x000000076ab00000,0x00000007a7900000)
  from space 194560K, 29% used [0x00000007b2a00000,0x00000007b6296478,0x00000007be800000)
  to   space 181248K, 0% used [0x00000007a7900000,0x00000007a7900000,0x00000007b2a00000)
 ParOldGen       total 1595904K, used 760276K [0x00000006c0000000, 0x0000000721680000, 0x000000076ab00000)
  object space 1595904K, 47% used [0x00000006c0000000,0x00000006ee675208,0x0000000721680000)
 Metaspace       used 185042K, capacity 199400K, committed 199976K, reserved 1204224K
  class space    used 35075K, capacity 44202K, committed 44328K, reserved 1048576K
}
Event: 93.037 GC heap before
{Heap before GC invocations=44 (full 5):
 PSYoungGen      total 1191936K, used 1055321K [0x000000076ab00000, 0x00000007c0000000, 0x00000007c0000000)
  eden space 997376K, 100% used [0x000000076ab00000,0x00000007a7900000,0x00000007a7900000)
  from space 194560K, 29% used [0x00000007b2a00000,0x00000007b6296478,0x00000007be800000)
  to   space 181248K, 0% used [0x00000007a7900000,0x00000007a7900000,0x00000007b2a00000)
 ParOldGen       total 1595904K, used 760276K [0x00000006c0000000, 0x0000000721680000, 0x000000076ab00000)
  object space 1595904K, 47% used [0x00000006c0000000,0x00000006ee675208,0x0000000721680000)
 Metaspace       used 190444K, capacity 204990K, committed 205352K, reserved 1210368K
  class space    used 36065K, capacity 45295K, committed 45352K, reserved 1048576K
Event: 93.085 GC heap after
Heap after GC invocations=44 (full 5):
 PSYoungGen      total 1178624K, used 113160K [0x000000076ab00000, 0x00000007c0000000, 0x00000007c0000000)
  eden space 997376K, 0% used [0x000000076ab00000,0x000000076ab00000,0x00000007a7900000)
  from space 181248K, 62% used [0x00000007a7900000,0x00000007ae7823b8,0x00000007b2a00000)
  to   space 189440K, 0% used [0x00000007b4700000,0x00000007b4700000,0x00000007c0000000)
 ParOldGen       total 1595904K, used 760284K [0x00000006c0000000, 0x0000000721680000, 0x000000076ab00000)
  object space 1595904K, 47% used [0x00000006c0000000,0x00000006ee677208,0x0000000721680000)
 Metaspace       used 190444K, capacity 204990K, committed 205352K, reserved 1210368K
  class space    used 36065K, capacity 45295K, committed 45352K, reserved 1048576K
}

Deoptimization events (10 events):
Event: 92.787 Thread 0x0000000002874800 Uncommon trap: reason=class_check action=maybe_recompile pc=0x00000000049e0738 method=java.awt.image.Raster.getPixel(II[I)[I @ 21
Event: 92.794 Thread 0x0000000002874800 Uncommon trap: reason=class_check action=maybe_recompile pc=0x00000000049e0738 method=java.awt.image.Raster.getPixel(II[I)[I @ 21
Event: 92.798 Thread 0x0000000002874800 Uncommon trap: reason=class_check action=maybe_recompile pc=0x00000000049e0738 method=java.awt.image.Raster.getPixel(II[I)[I @ 21
Event: 92.803 Thread 0x0000000002874800 Uncommon trap: reason=class_check action=maybe_recompile pc=0x00000000049e0738 method=java.awt.image.Raster.getPixel(II[I)[I @ 21
Event: 93.015 Thread 0x0000000002874800 Uncommon trap: reason=bimorphic action=maybe_recompile pc=0x0000000004614358 method=java.util.HashMap.computeIfAbsent(Ljava/lang/Object;Ljava/util/function/Function;)Ljava/lang/Object; @ 142
Event: 93.016 Thread 0x0000000002874800 Uncommon trap: reason=bimorphic action=maybe_recompile pc=0x0000000004614358 method=java.util.HashMap.computeIfAbsent(Ljava/lang/Object;Ljava/util/function/Function;)Ljava/lang/Object; @ 142
Event: 93.016 Thread 0x0000000002874800 Uncommon trap: reason=bimorphic action=maybe_recompile pc=0x0000000004614358 method=java.util.HashMap.computeIfAbsent(Ljava/lang/Object;Ljava/util/function/Function;)Ljava/lang/Object; @ 142
Event: 93.017 Thread 0x0000000002874800 Uncommon trap: reason=bimorphic action=maybe_recompile pc=0x0000000004614358 method=java.util.HashMap.computeIfAbsent(Ljava/lang/Object;Ljava/util/function/Function;)Ljava/lang/Object; @ 142
Event: 93.019 Thread 0x0000000002874800 Uncommon trap: reason=unstable_if action=reinterpret pc=0x000000000460e084 method=com.google.common.collect.ImmutableSet.construct(I[Ljava/lang/Object;)Lcom/google/common/collect/ImmutableSet; @ 146
Event: 93.095 Thread 0x0000000002874800 Uncommon trap: reason=class_check action=maybe_recompile pc=0x0000000003fb2514 method=com.google.common.collect.Lists.newArrayList(Ljava/lang/Iterable;)Ljava/util/ArrayList; @ 27

Classes redefined (0 events):
No events

Internal exceptions (10 events):
Event: 85.710 Thread 0x0000000002874800 Implicit null exception at 0x0000000004523d51 to 0x0000000004523e15
Event: 89.469 Thread 0x0000000002874800 Exception <a 'java/lang/IncompatibleClassChangeError': Found class java.lang.Object, but interface was expected> (0x0000000770687070) thrown at [C:\re\workspace\8-2-build-windows-amd64-cygwin\jdk8u161\10277\hotspot\src\share\vm\interpreter\linkResolver.cp
Event: 91.132 Thread 0x0000000002874800 Exception <a 'java/lang/IncompatibleClassChangeError': Found class java.lang.Object, but interface was expected> (0x00000007914f1de0) thrown at [C:\re\workspace\8-2-build-windows-amd64-cygwin\jdk8u161\10277\hotspot\src\share\vm\interpreter\linkResolver.cp
Event: 92.979 Thread 0x00000000216a6800 Exception <a 'java/lang/InterruptedException': sleep interrupted> (0x00000007a42dacd0) thrown at [C:\re\workspace\8-2-build-windows-amd64-cygwin\jdk8u161\10277\hotspot\src\share\vm\prims\jvm.cpp, line 3228]
Event: 93.017 Thread 0x00000000216a6800 Exception <a 'java/security/PrivilegedActionException'> (0x00000007a6f4ab88) thrown at [C:\re\workspace\8-2-build-windows-amd64-cygwin\jdk8u161\10277\hotspot\src\share\vm\prims\jvm.cpp, line 1390]
Event: 93.017 Thread 0x00000000216a6800 Exception <a 'java/security/PrivilegedActionException'> (0x00000007a6f4c070) thrown at [C:\re\workspace\8-2-build-windows-amd64-cygwin\jdk8u161\10277\hotspot\src\share\vm\prims\jvm.cpp, line 1390]
Event: 93.018 Thread 0x00000000216a6800 Exception <a 'java/security/PrivilegedActionException'> (0x00000007a6f4db18) thrown at [C:\re\workspace\8-2-build-windows-amd64-cygwin\jdk8u161\10277\hotspot\src\share\vm\prims\jvm.cpp, line 1390]
Event: 93.018 Thread 0x00000000216a6800 Exception <a 'java/security/PrivilegedActionException'> (0x00000007a6f4f310) thrown at [C:\re\workspace\8-2-build-windows-amd64-cygwin\jdk8u161\10277\hotspot\src\share\vm\prims\jvm.cpp, line 1390]
Event: 93.018 Thread 0x00000000216a6800 Exception <a 'java/security/PrivilegedActionException'> (0x00000007a6f50780) thrown at [C:\re\workspace\8-2-build-windows-amd64-cygwin\jdk8u161\10277\hotspot\src\share\vm\prims\jvm.cpp, line 1390]
Event: 93.018 Thread 0x00000000216a6800 Exception <a 'java/security/PrivilegedActionException'> (0x00000007a6f51d68) thrown at [C:\re\workspace\8-2-build-windows-amd64-cygwin\jdk8u161\10277\hotspot\src\share\vm\prims\jvm.cpp, line 1390]

Events (10 events):
Event: 93.105 Thread 0x000000001e3a1000 flushing nmethod 0x0000000002d061d0
Event: 93.105 Thread 0x000000001e3a1000 flushing nmethod 0x0000000002d13bd0
Event: 93.105 loading class org/lwjgl/openal/Util
Event: 93.105 loading class org/lwjgl/openal/Util done
Event: 93.105 Thread 0x000000001e3a1000 flushing nmethod 0x0000000002d7bdd0
Event: 93.106 loading class org/lwjgl/openal/OpenALException
Event: 93.106 Thread 0x000000001e3a1000 flushing nmethod 0x0000000002e0f090
Event: 93.106 loading class org/lwjgl/openal/OpenALException done
Event: 93.106 Thread 0x000000001e3a1000 flushing nmethod 0x0000000002e12610
Event: 93.106 Thread 0x000000001e3a1000 flushing nmethod 0x0000000002e34010


Dynamic libraries:
0x00007ff7bc7f0000 - 0x00007ff7bc827000 	C:\Program Files\Java\jdk1.8.0_161\bin\javaw.exe
0x00007ffba6280000 - 0x00007ffba6470000 	C:\WINDOWS\SYSTEM32\ntdll.dll
0x00007ffba4af0000 - 0x00007ffba4ba2000 	C:\WINDOWS\System32\KERNEL32.DLL
0x00007ffba3af0000 - 0x00007ffba3d93000 	C:\WINDOWS\System32\KERNELBASE.dll
0x00007ffba4d50000 - 0x00007ffba4df3000 	C:\WINDOWS\System32\ADVAPI32.dll
0x00007ffba5400000 - 0x00007ffba549e000 	C:\WINDOWS\System32\msvcrt.dll
0x00007ffba5580000 - 0x00007ffba5617000 	C:\WINDOWS\System32\sechost.dll
0x00007ffba4ea0000 - 0x00007ffba4fc0000 	C:\WINDOWS\System32\RPCRT4.dll
0x00007ffba4bb0000 - 0x00007ffba4d44000 	C:\WINDOWS\System32\USER32.dll
0x00007ffba3210000 - 0x00007ffba3231000 	C:\WINDOWS\System32\win32u.dll
0x00007ffba58b0000 - 0x00007ffba58d6000 	C:\WINDOWS\System32\GDI32.dll
0x00007ffba3f20000 - 0x00007ffba40b4000 	C:\WINDOWS\System32\gdi32full.dll
0x00007ffba40c0000 - 0x00007ffba415e000 	C:\WINDOWS\System32\msvcp_win.dll
0x00007ffba3da0000 - 0x00007ffba3e9a000 	C:\WINDOWS\System32\ucrtbase.dll
0x00007ffb87ae0000 - 0x00007ffb87d65000 	C:\WINDOWS\WinSxS\amd64_microsoft.windows.common-controls_6595b64144ccf1df_6.0.18362.476_none_e6c4b11b130f2595\COMCTL32.dll
0x00007ffba5a90000 - 0x00007ffba5dc6000 	C:\WINDOWS\System32\combase.dll
0x00007ffba4160000 - 0x00007ffba41e0000 	C:\WINDOWS\System32\bcryptPrimitives.dll
0x00007ffba4e00000 - 0x00007ffba4e2e000 	C:\WINDOWS\System32\IMM32.DLL
0x0000000077f20000 - 0x0000000077ff2000 	C:\Program Files\Java\jdk1.8.0_161\jre\bin\msvcr100.dll
0x00000000773e0000 - 0x0000000077c7f000 	C:\Program Files\Java\jdk1.8.0_161\jre\bin\server\jvm.dll
0x00007ffba5760000 - 0x00007ffba5768000 	C:\WINDOWS\System32\PSAPI.DLL
0x00007ffb8a980000 - 0x00007ffb8a989000 	C:\WINDOWS\SYSTEM32\WSOCK32.dll
0x00007ffb98590000 - 0x00007ffb985b4000 	C:\WINDOWS\SYSTEM32\WINMM.dll
0x00007ffb9d580000 - 0x00007ffb9d58a000 	C:\WINDOWS\SYSTEM32\VERSION.dll
0x00007ffba51e0000 - 0x00007ffba524f000 	C:\WINDOWS\System32\WS2_32.dll
0x00007ffb98560000 - 0x00007ffb9858d000 	C:\WINDOWS\SYSTEM32\winmmbase.dll
0x00007ffba39c0000 - 0x00007ffba3a0a000 	C:\WINDOWS\System32\cfgmgr32.dll
0x00000000500c0000 - 0x00000000500cf000 	C:\Program Files\Java\jdk1.8.0_161\jre\bin\verify.dll
0x0000000050090000 - 0x00000000500b9000 	C:\Program Files\Java\jdk1.8.0_161\jre\bin\java.dll
0x0000000050070000 - 0x0000000050086000 	C:\Program Files\Java\jdk1.8.0_161\jre\bin\zip.dll
0x00007ffba43e0000 - 0x00007ffba4ac5000 	C:\WINDOWS\System32\SHELL32.dll
0x00007ffba4330000 - 0x00007ffba43d9000 	C:\WINDOWS\System32\shcore.dll
0x00007ffba3240000 - 0x00007ffba39be000 	C:\WINDOWS\System32\windows.storage.dll
0x00007ffba31f0000 - 0x00007ffba320f000 	C:\WINDOWS\System32\profapi.dll
0x00007ffba3160000 - 0x00007ffba31aa000 	C:\WINDOWS\System32\powrprof.dll
0x00007ffba3150000 - 0x00007ffba3160000 	C:\WINDOWS\System32\UMPDC.dll
0x00007ffba54a0000 - 0x00007ffba54f2000 	C:\WINDOWS\System32\shlwapi.dll
0x00007ffba31b0000 - 0x00007ffba31c1000 	C:\WINDOWS\System32\kernel.appcore.dll
0x00007ffba3f00000 - 0x00007ffba3f17000 	C:\WINDOWS\System32\cryptsp.dll
0x0000000050060000 - 0x000000005006d000 	C:\Program Files\Java\jdk1.8.0_161\jre\bin\management.dll
0x0000000050040000 - 0x000000005005a000 	C:\Program Files\Java\jdk1.8.0_161\jre\bin\net.dll
0x00007ffba2970000 - 0x00007ffba29d7000 	C:\WINDOWS\system32\mswsock.dll
0x00007ffb8c8c0000 - 0x00007ffb8c8d6000 	C:\WINDOWS\system32\napinsp.dll
0x00007ffb8c3b0000 - 0x00007ffb8c3ca000 	C:\WINDOWS\system32\pnrpnsp.dll
0x00007ffba26d0000 - 0x00007ffba279a000 	C:\WINDOWS\SYSTEM32\DNSAPI.dll
0x00007ffba5680000 - 0x00007ffba5688000 	C:\WINDOWS\System32\NSI.dll
0x00007ffba2690000 - 0x00007ffba26ca000 	C:\WINDOWS\SYSTEM32\IPHLPAPI.DLL
0x00007ffb8bfd0000 - 0x00007ffb8bfde000 	C:\WINDOWS\System32\winrnr.dll
0x00007ffb9d6c0000 - 0x00007ffb9d6dc000 	C:\WINDOWS\system32\NLAapi.dll
0x00007ffb9edf0000 - 0x00007ffb9ee05000 	C:\WINDOWS\system32\wshbth.dll
0x00007ffb9cb80000 - 0x00007ffb9cb8a000 	C:\Windows\System32\rasadhlp.dll
0x00007ffb9cb90000 - 0x00007ffb9cc07000 	C:\WINDOWS\System32\fwpuclnt.dll
0x00007ffba3a10000 - 0x00007ffba3a36000 	C:\WINDOWS\System32\bcrypt.dll
0x0000000050020000 - 0x0000000050031000 	C:\Program Files\Java\jdk1.8.0_161\jre\bin\nio.dll
0x00007ffba24f0000 - 0x00007ffba2523000 	C:\WINDOWS\system32\rsaenh.dll
0x00007ffba3070000 - 0x00007ffba3095000 	C:\WINDOWS\SYSTEM32\USERENV.dll
0x00007ffba2af0000 - 0x00007ffba2afc000 	C:\WINDOWS\SYSTEM32\CRYPTBASE.dll
0x00007ffb9d350000 - 0x00007ffb9d366000 	C:\WINDOWS\SYSTEM32\dhcpcsvc6.DLL
0x00007ffb9d330000 - 0x00007ffb9d34c000 	C:\WINDOWS\SYSTEM32\dhcpcsvc.DLL
0x0000000050000000 - 0x0000000050017000 	C:\Program Files\Java\jdk1.8.0_161\jre\bin\unpack.dll
0x0000000180000000 - 0x0000000180053000 	D:\Program Files\MultiMC\instances\Tetral Takeover DEV\natives\lwjgl64.dll
0x00007ffb710e0000 - 0x00007ffb71236000 	C:\WINDOWS\SYSTEM32\OPENGL32.dll
0x00007ffb9e8f0000 - 0x00007ffb9e91c000 	C:\WINDOWS\SYSTEM32\GLU32.dll
0x00007ffba1d60000 - 0x00007ffba1d80000 	C:\WINDOWS\SYSTEM32\dxcore.dll
0x0000000077d80000 - 0x0000000077f18000 	C:\Program Files\Java\jdk1.8.0_161\jre\bin\awt.dll
0x00007ffba5960000 - 0x00007ffba5a24000 	C:\WINDOWS\System32\OLEAUT32.dll
0x00007ffba1290000 - 0x00007ffba131f000 	C:\WINDOWS\SYSTEM32\apphelp.dll
0x00007ffb97280000 - 0x00007ffb9732e000 	C:\WINDOWS\SYSTEM32\mscms.dll
0x00007ffb97230000 - 0x00007ffb97247000 	C:\WINDOWS\SYSTEM32\ColorAdapterClient.dll
0x00007ffba13d0000 - 0x00007ffba1469000 	C:\WINDOWS\system32\uxtheme.dll
0x00007ffba5770000 - 0x00007ffba58a6000 	C:\WINDOWS\System32\MSCTF.dll
0x00007ffb8e480000 - 0x00007ffb8e4e5000 	C:\WINDOWS\system32\Oleacc.dll
0x0000000074da0000 - 0x00000000773d9000 	C:\WINDOWS\System32\DriverStore\FileRepository\nv_dispi.inf_amd64_830a0263f2ee97ce\nvoglv64.dll
0x00007ffba5dd0000 - 0x00007ffba6240000 	C:\WINDOWS\System32\SETUPAPI.dll
0x00007ffba5080000 - 0x00007ffba51d6000 	C:\WINDOWS\System32\ole32.dll
0x00007ffb9e160000 - 0x00007ffb9e173000 	C:\WINDOWS\SYSTEM32\WTSAPI32.dll
0x00007ffba2f50000 - 0x00007ffba2f7a000 	C:\WINDOWS\SYSTEM32\DEVOBJ.dll
0x00007ffba3ea0000 - 0x00007ffba3efc000 	C:\WINDOWS\System32\WINTRUST.dll
0x00007ffba31d0000 - 0x00007ffba31e2000 	C:\WINDOWS\System32\MSASN1.dll
0x00007ffba41e0000 - 0x00007ffba4329000 	C:\WINDOWS\System32\CRYPT32.dll
0x00007ffba2150000 - 0x00007ffba2181000 	C:\WINDOWS\SYSTEM32\ntmarta.dll
0x00007ffba1890000 - 0x00007ffba18bd000 	C:\WINDOWS\SYSTEM32\dwmapi.dll
0x00007ffb81490000 - 0x00007ffb81752000 	C:\WINDOWS\system32\nvspcap64.dll
0x00007ffb4f8b0000 - 0x00007ffb4f8f3000 	C:\WINDOWS\SYSTEM32\icm32.dll
0x00007ffba21c0000 - 0x00007ffba221c000 	C:\WINDOWS\SYSTEM32\WINSTA.dll
0x00007ffb90c50000 - 0x00007ffb90c92000 	C:\Users\JustL\AppData\Local\Temp\jna-71940288\jna7376159914184046868.dll
0x0000000077d50000 - 0x0000000077d74000 	C:\Program Files\Java\jdk1.8.0_161\jre\bin\sunec.dll
0x0000000077d40000 - 0x0000000077d4b000 	C:\Program Files\Java\jdk1.8.0_161\jre\bin\sunmscapi.dll
0x00007ffb70e90000 - 0x00007ffb70fbd000 	D:\Program Files\MultiMC\instances\Tetral Takeover DEV\.minecraft\OpenComputersMod-1.7.4.153-lua52-native.64.dll
0x00007ffb6df30000 - 0x00007ffb6e0d1000 	D:\Program Files\MultiMC\instances\Tetral Takeover DEV\.minecraft\OpenComputersMod-1.7.4.153-lua53-native.64.dll
0x00007ffb97400000 - 0x00007ffb9749e000 	C:\WINDOWS\System32\TextInputFramework.dll
0x00007ffb97bd0000 - 0x00007ffb97efa000 	C:\WINDOWS\System32\CoreUIComponents.dll
0x00007ffba0bb0000 - 0x00007ffba0c84000 	C:\WINDOWS\System32\CoreMessaging.dll
0x00007ffb9f3f0000 - 0x00007ffb9f543000 	C:\WINDOWS\SYSTEM32\wintypes.dll
0x00007ffb95640000 - 0x00007ffb958e6000 	C:\WINDOWS\System32\iertutil.dll
0x0000000023e30000 - 0x0000000023e94000 	D:\Program Files\MultiMC\instances\Tetral Takeover DEV\natives\OpenAL64.dll
0x00007ffba4fc0000 - 0x00007ffba5062000 	C:\WINDOWS\System32\clbcatq.dll
0x00007ffb9cfb0000 - 0x00007ffb9d022000 	C:\WINDOWS\System32\MMDevApi.dll
0x00007ffb6f020000 - 0x00007ffb6f0b9000 	C:\WINDOWS\SYSTEM32\dsound.dll
0x00007ffb9d0f0000 - 0x00007ffb9d24d000 	C:\WINDOWS\SYSTEM32\AUDIOSES.DLL
0x00007ffb9b760000 - 0x00007ffb9b954000 	C:\WINDOWS\SYSTEM32\dbghelp.dll

VM Arguments:
jvm_args: -XX:HeapDumpPath=MojangTricksIntelDriversForPerformance_javaw.exe_minecraft.exe.heapdump -Xms1024m -Xmx4096m -Duser.language=en -Djava.library.path=D:/Program Files/MultiMC/instances/Tetral Takeover DEV/natives 
java_command: org.multimc.EntryPoint
java_class_path (initial): D:/Program Files/MultiMC/jars/NewLaunch.jar;D:/Program Files/MultiMC/libraries/net/java/jinput/jinput/2.0.5/jinput-2.0.5.jar;D:/Program Files/MultiMC/libraries/net/java/jutils/jutils/1.0.0/jutils-1.0.0.jar;D:/Program Files/MultiMC/libraries/org/lwjgl/lwjgl/lwjgl/2.9.4-nightly-20150209/lwjgl-2.9.4-nightly-20150209.jar;D:/Program Files/MultiMC/libraries/org/lwjgl/lwjgl/lwjgl_util/2.9.4-nightly-20150209/lwjgl_util-2.9.4-nightly-20150209.jar;D:/Program Files/MultiMC/libraries/com/mojang/patchy/1.1/patchy-1.1.jar;D:/Program Files/MultiMC/libraries/oshi-project/oshi-core/1.1/oshi-core-1.1.jar;D:/Program Files/MultiMC/libraries/net/java/dev/jna/jna/4.4.0/jna-4.4.0.jar;D:/Program Files/MultiMC/libraries/net/java/dev/jna/platform/3.4.0/platform-3.4.0.jar;D:/Program Files/MultiMC/libraries/com/ibm/icu/icu4j-core-mojang/51.2/icu4j-core-mojang-51.2.jar;D:/Program Files/MultiMC/libraries/net/sf/jopt-simple/jopt-simple/5.0.3/jopt-simple-5.0.3.jar;D:/Program Files/MultiMC/libraries/com/paulscode/codecjorbis/20101023/codecjorbis-20101023.jar;D:/Program Files/MultiMC/libraries/com/paulscode/codecwav/20101023/codecwav-20101023.jar;D:/Program Files/MultiMC/libraries/com/paulscode/libraryjavasound/20101123/libraryjavasound-20101123.jar;D:/Program Files/MultiMC/libraries/com/paulscode/librarylwjglopenal/20100824/librarylwjglopenal-20100824.jar;D:/Program Files/MultiMC/libraries/com/paulscode/soundsystem/20120107/soundsystem-20120107.jar;D:/Program Files/MultiMC/libraries/io/netty/netty-all/4.1.9.Final/netty-all-4.1.9.Final.jar;D:/Program Files/MultiMC/libraries/com/google/guava/guava/21.0/guava-21.0.jar;D:/Program Files/MultiMC/libraries/org/apache/commons/commons-lang3/3.5/commons-lang3-3.5.jar;D:/Program Files/MultiMC/libraries/commons-io/commons-io/2.5/commons-io-2.5.jar;D:/Program Files/MultiMC/libraries/commons-codec/commons-codec/1.10/commons-codec-1.10.jar;D:/Program Files/MultiMC/libraries/com/google/code/gson/gson/2.8.0/gson-2.8.0.jar;D:/Program Fil
Launcher Type: SUN_STANDARD

Environment Variables:
PATH=D:\Oculus\Support\oculus-runtime;C:\ProgramData\DockerDesktop\version-bin;C:\Program Files\Docker\Docker\Resources\bin;C:\Program Files\Microsoft MPI\Bin\;C:\Windows\system32;C:\Windows;C:\Windows\System32\Wbem;C:\Windows\System32\WindowsPowerShell\v1.0\;C:\Program Files\dotnet\;C:\Program Files\Microsoft SQL Server\130\Tools\Binn\;C:\Program Files (x86)\NVIDIA Corporation\PhysX\Common;C:\Program Files\Java\jdk1.8.0_161\bin;C:\Program Files\Common Files\Autodesk Shared\;D:\AndroidSDK\platform-tools;C:\WINDOWS\system32;C:\WINDOWS;C:\WINDOWS\System32\Wbem;C:\WINDOWS\System32\WindowsPowerShell\v1.0\;C:\WINDOWS\System32\OpenSSH\;D:\Program Files\WinSCP\;D:\Program Files\PuTTY\;C:\Program Files\NVIDIA Corporation\NVIDIA NvDLISR;C:\WINDOWS\system32;C:\WINDOWS;C:\WINDOWS\System32\Wbem;C:\WINDOWS\System32\WindowsPowerShell\v1.0\;C:\WINDOWS\System32\OpenSSH\;C:\Program Files\Intel\WiFi\bin\;C:\Program Files\Common Files\Intel\WirelessCommon\;C:\Program Files\NVIDIA Corporation\NVIDIA NGX;D:\Program Files\Git\cmd;D:\Program Files\nodejs\;D\Program Files\apache-maven-3.6.1\bin;C:\Users\JustL\AppData\Local\Microsoft\WindowsApps;D:\Program Files\Microsoft Visual Studio\Microsoft VS Code\bin;C:\Users\JustL\AppData\Roaming\Dashlane\5.14.0.21388\bin\Firefox_Extension\{442718d9-475e-452a-b3e1-fb1ee16b8e9f}\components;C:\Users\JustL\AppData\Roaming\Dashlane\5.14.0.21388\ucrt;C:\Program Files\Intel\WiFi\bin\;C:\Program Files\Common Files\Intel\WirelessCommon\;D:\Program Files\Microsoft VS Code\bin;C:\Users\JustL\AppData\Roaming\npm;D:\Program Files\JetBrains\IntelliJ IDEA Community Edition 2019.2\bin;
USERNAME=JustL
OS=Windows_NT
PROCESSOR_IDENTIFIER=AMD64 Family 23 Model 1 Stepping 1, AuthenticAMD



---------------  S Y S T E M  ---------------

OS: Windows 10.0 , 64 bit Build 18362 (10.0.18362.329)

CPU:total 8 (initial active 8) (8 cores per cpu, 1 threads per core) family 23 model 1 stepping 1, cmov, cx8, fxsr, mmx, sse, sse2, sse3, ssse3, sse4.1, sse4.2, popcnt, avx, avx2, aes, clmul, mmxext, 3dnowpref, lzcnt, sse4a, tsc, tscinvbit, tscinv, bmi1

Memory: 4k page, physical 16710772k(5173968k free), swap 31915124k(14422528k free)

vm_info: Java HotSpot(TM) 64-Bit Server VM (25.161-b12) for windows-amd64 JRE (1.8.0_161-b12), built on Dec 19 2017 17:52:25 by "java_re" with MS VC++ 10.0 (VS2010)

time: Sat Nov 16 16:44:33 2019
elapsed time: 93 seconds (0d 0h 1m 33s)

