[
	{
		"time": 1573968301586,
		"file": "2019-11-17-00-25-01.zip",
		"index": 1,
		"success": true,
		"size": 15072964
	},
	{
		"time": 1573975501625,
		"file": "2019-11-17-02-25-01.zip",
		"index": 2,
		"success": true,
		"size": 15107929
	},
	{
		"time": 1573982701668,
		"file": "2019-11-17-04-25-01.zip",
		"index": 3,
		"success": true,
		"size": 15136226
	},
	{
		"time": 1573989901656,
		"file": "2019-11-17-06-25-01.zip",
		"index": 4,
		"success": true,
		"size": 15150338
	},
	{
		"time": 1574019508611,
		"file": "2019-11-17-14-38-28.zip",
		"index": 5,
		"success": true,
		"size": 862653521
	},
	{
		"time": 1574379323696,
		"file": "2019-11-21-18-35-23.zip",
		"index": 6,
		"success": true,
		"size": 3513370
	}
]