[
  {
    "name": "LAUNCH STATISTICS AREA",
    "widgetType": "statisticTrend",
    "share": true,
    "contentParameters": {
      "itemsCount": 50,
      "contentFields": [
        "statistics$executions$total",
        "statistics$executions$passed",
        "statistics$executions$failed",
        "statistics$executions$skipped",
        "statistics$defects$product_bug$pb001",
        "statistics$defects$test_bug$tb001",
        "statistics$defects$system_issue$si001",
        "statistics$defects$to_investigate$ti001"
      ],
      "widgetOptions": {
        "timeline": "launch",
        "viewMode": "area-spline",
        "zoom": false
      }
    }
  },
  {
    "name": "LAUNCH STATISTICS BAR",
    "widgetType": "statisticTrend",
    "share": true,
    "contentParameters": {
      "itemsCount": 50,
      "contentFields": [
        "statistics$executions$passed",
        "statistics$executions$failed",
        "statistics$executions$skipped"
      ],
      "widgetOptions": {
        "timeline": "launch",
        "viewMode": "bar",
        "zoom": false
      }
    }
  },
  {
    "name": "INVESTIGATED PERCENTAGE OF LAUNCHES",
    "widgetType": "investigatedTrend",
    "share": true,
    "contentParameters": {
      "itemsCount": 50,
      "contentFields": [
      ],
      "widgetOptions": {
        "timeline": "launch"
      }
    }
  },
  {
    "name": "TEST CASES GROWTH TREND CHART",
    "widgetType": "casesTrend",
    "share": true,
    "contentParameters": {
      "itemsCount": 50,
      "contentFields": [
        "statistics$executions$total"
      ],
      "widgetOptions": {
      }
    }
  },
  {
    "name": "OVERALL STATISTICS PANEL",
    "widgetType": "overallStatistics",
    "share": true,
    "contentParameters": {
      "itemsCount": 50,
      "contentFields": [
        "statistics$executions$total",
        "statistics$executions$passed",
        "statistics$executions$failed",
        "statistics$executions$skipped",
        "statistics$defects$product_bug$pb001",
        "statistics$defects$test_bug$tb001",
        "statistics$defects$system_issue$si001",
        "statistics$defects$to_investigate$ti001"
      ],
      "widgetOptions": {
        "latest": false,
        "viewMode": "panel"
      }
    }
  },
  {
    "name": "LAUNCHES DURATION CHART",
    "widgetType": "launchesDurationChart",
    "share": true,
    "contentParameters": {
      "itemsCount": 50,
      "contentFields": [
      ],
      "widgetOptions": {
        "latest": false
      }
    }
  },
  {
    "name": "OVERALL STATISTICS DONUT",
    "widgetType": "overallStatistics",
    "share": true,
    "contentParameters": {
      "itemsCount": 50,
      "contentFields": [
        "statistics$executions$total",
        "statistics$executions$passed",
        "statistics$executions$failed",
        "statistics$executions$skipped",
        "statistics$defects$product_bug$pb001",
        "statistics$defects$test_bug$tb001",
        "statistics$defects$system_issue$si001",
        "statistics$defects$to_investigate$ti001"
      ],
      "widgetOptions": {
        "latest": false,
        "viewMode": "donut"
      }
    }
  },
  {
    "name": "FAILED CASES TREND CHART",
    "widgetType": "bugTrend",
    "share": true,
    "contentParameters": {
      "itemsCount": 50,
      "contentFields": [
        "statistics$defects$to_investigate$total",
        "statistics$defects$product_bug$total",
        "statistics$defects$test_bug$total",
        "statistics$defects$system_issue$total",
        "statistics$defects$minor_defect$total"
      ],
      "widgetOptions": {
      }
    }
  },
  {
    "name": "LAUNCH TABLE",
    "widgetType": "launchesTable",
    "share": true,
    "contentParameters": {
      "itemsCount": 50,
      "contentFields": [
        "name",
        "status",
        "startTime",
        "endTime",
        "lastModified",
        "number",
        "description",
        "user",
        "attributes",
        "statistics$executions$total",
        "statistics$executions$passed",
        "statistics$executions$failed",
        "statistics$executions$skipped",
        "statistics$defects$product_bug$pb001",
        "statistics$defects$test_bug$tb001",
        "statistics$defects$system_issue$si001",
        "statistics$defects$to_investigate$ti001"
      ],
      "widgetOptions": {
      }
    }
  },
  {
    "name": "MOST FAILED TEST CASES",
    "widgetType": "topTestCases",
    "share": true,
    "contentParameters": {
      "itemsCount": 30,
      "contentFields": [
        "statistics$executions$failed"
      ],
      "widgetOptions": {
        "launchNameFilter": "Demo Api Tests",
        "includeMethods": false
      }
    }
  },
  {
    "name": "PASSING RATE SUMMARY",
    "share": true,
    "widgetType": "passingRateSummary",
    "contentParameters": {
      "itemsCount": 50,
      "contentFields": [
        "statistics$executions$total",
        "statistics$executions$passed"
      ],
      "widgetOptions": {
        "viewMode": "pie"
      }
    }
  },
  {
    "name": "FLAKY TEST CASES",
    "widgetType": "flakyTestCases",
    "share": true,
    "contentParameters": {
      "itemsCount": 30,
      "contentFields": [
      ],
      "widgetOptions": {
        "launchNameFilter": "Demo Api Tests",
        "includeMethods": false
      }
    }
  }
]
