{
 "allow_import": 1,
 "allow_rename": 1,
 "autoname": "naming_series:",
 "creation": "2021-03-08 12:55:49.406488",
 "doctype": "DocType",
 "editable_grid": 1,
 "engine": "InnoDB",
 "field_order": [
  "naming_series",
  "customer",
  "customer_name",
  "customer_name_print",
  "address",
  "attention",
  "column_break_7",
  "date",
  "remarks",
  "section_break_9",
  "excel_mps_counter_table",
  "amended_from",
  "section_break_12",
  "total_bw",
  "column_break_14",
  "total_color"
 ],
 "fields": [
  {
   "fieldname": "naming_series",
   "fieldtype": "Select",
   "hidden": 1,
   "label": "Naming Series",
   "options": "CNTR-.YY.-"
  },
  {
   "fieldname": "customer",
   "fieldtype": "Link",
   "label": "Customer",
   "options": "Customer"
  },
  {
   "fetch_from": "customer.customer_name",
   "fieldname": "customer_name",
   "fieldtype": "Data",
   "label": "Customer Name",
   "read_only": 1
  },
  {
   "fieldname": "address",
   "fieldtype": "Data",
   "label": "Address"
  },
  {
   "fieldname": "attention",
   "fieldtype": "Data",
   "label": "Attention"
  },
  {
   "fieldname": "remarks",
   "fieldtype": "Small Text",
   "label": "Remarks"
  },
  {
   "fieldname": "column_break_7",
   "fieldtype": "Column Break"
  },
  {
   "fieldname": "date",
   "fieldtype": "Date",
   "label": "Date"
  },
  {
   "fieldname": "amended_from",
   "fieldtype": "Link",
   "label": "Amended From",
   "no_copy": 1,
   "options": "Excel MPS Counter",
   "print_hide": 1,
   "read_only": 1
  },
  {
   "fieldname": "section_break_9",
   "fieldtype": "Section Break"
  },
  {
   "fieldname": "excel_mps_counter_table",
   "fieldtype": "Table",
   "label": "Excel MPS Counter Table",
   "options": "Excel MPS Counter Table"
  },
  {
   "fieldname": "section_break_12",
   "fieldtype": "Section Break"
  },
  {
   "fieldname": "total_bw",
   "fieldtype": "Int",
   "label": "Total BW",
   "read_only": 1
  },
  {
   "fieldname": "column_break_14",
   "fieldtype": "Column Break"
  },
  {
   "fieldname": "total_color",
   "fieldtype": "Int",
   "label": "Total Color",
   "read_only": 1
  },
  {
   "fieldname": "customer_name_print",
   "fieldtype": "Data",
   "label": "Customer Name Print"
  }
 ],
 "is_submittable": 1,
 "modified": "2021-03-31 16:59:42.799967",
 "modified_by": "Administrator",
 "module": "Excel ERPNext",
 "name": "Excel MPS Counter",
 "owner": "Administrator",
 "permissions": [
  {
   "amend": 1,
   "cancel": 1,
   "create": 1,
   "delete": 1,
   "email": 1,
   "export": 1,
   "print": 1,
   "read": 1,
   "report": 1,
   "role": "System Manager",
   "share": 1,
   "submit": 1,
   "write": 1
  },
  {
   "amend": 1,
   "cancel": 1,
   "create": 1,
   "delete": 1,
   "email": 1,
   "export": 1,
   "import": 1,
   "print": 1,
   "read": 1,
   "report": 1,
   "role": "Projects Manager",
   "share": 1,
   "submit": 1,
   "write": 1
  },
  {
   "create": 1,
   "email": 1,
   "export": 1,
   "import": 1,
   "print": 1,
   "read": 1,
   "report": 1,
   "role": "Projects User",
   "share": 1,
   "submit": 1,
   "write": 1
  }
 ],
 "quick_entry": 1,
 "sort_field": "modified",
 "sort_order": "DESC",
 "track_changes": 1
}