{
 "add_total_row": 1,
 "creation": "2021-01-31 22:29:08.602038",
 "disable_prepared_report": 0,
 "disabled": 0,
 "docstatus": 0,
 "doctype": "Report",
 "idx": 0,
 "is_standard": "Yes",
 "modified": "2021-02-11 13:16:05.336122",
 "modified_by": "Administrator",
 "module": "Excel Reports",
 "name": "Excel Customer Ledger",
 "owner": "Administrator",
 "prepared_report": 0,
 "ref_doctype": "GL Entry",
 "report_name": "Excel Customer Ledger",
 "report_type": "Script Report",
 "roles": [
    {
        "role": "Accounts Manager"
       },
       {
         "role": "Branch Accounts User"
        },  
        {
         "role": "Branch Sales Creator"
        },
        {
         "role": "Branch Sales Approver"
        },
        {
         "role": "Branch Sales Manager"
        },
        {
         "role": "Branch Sales Return User"
        },
        {
         "role": "Branch Stock User"
        },
        {
         "role": "Branch Stock Supervisor"
        },
        {
         "role": "General Admin"
        },
        {
         "role": "Branch Stock Manager"
        },
       {
        "role": "System Manager"
       }
      ]
   
}