{
 "allow_import": 1,
 "allow_rename": 1,
 "autoname": "DTasks.######",
 "creation": "2021-05-03 10:38:05.475178",
 "doctype": "DocType",
 "editable_grid": 1,
 "engine": "InnoDB",
 "field_order": [
  "employee_user",
  "date",
  "column_break_3",
  "employee_name",
  "time",
  "section_break_6",
  "daily_task_list",
  "amended_from"
 ],
 "fields": [
  {
   "default": "user",
   "fieldname": "employee_user",
   "fieldtype": "Link",
   "in_standard_filter": 1,
   "label": "Employee User",
   "options": "User",
   "reqd": 1
  },
  {
   "default": "Today",
   "fieldname": "date",
   "fieldtype": "Date",
   "in_list_view": 1,
   "in_standard_filter": 1,
   "label": "Date",
   "read_only": 1
  },
  {
   "fieldname": "column_break_3",
   "fieldtype": "Column Break"
  },
  {
   "fetch_from": "employee_user.full_name",
   "fieldname": "employee_name",
   "fieldtype": "Data",
   "in_list_view": 1,
   "label": "Employee Name"
  },
  {
   "fieldname": "time",
   "fieldtype": "Time",
   "label": "Time",
   "read_only": 1
  },
  {
   "fieldname": "section_break_6",
   "fieldtype": "Section Break"
  },
  {
   "fieldname": "daily_task_list",
   "fieldtype": "Table",
   "label": "Daily Task List",
   "options": "Excel Daily Task Table"
  },
  {
   "fieldname": "amended_from",
   "fieldtype": "Link",
   "label": "Amended From",
   "no_copy": 1,
   "options": "Excel Daily Task",
   "print_hide": 1,
   "read_only": 1
  }
 ],
 "is_submittable": 1,
 "modified": "2021-05-03 13:56:28.729211",
 "modified_by": "Administrator",
 "module": "Excel ERPNext",
 "name": "Excel Daily Task",
 "owner": "Administrator",
 "permissions": [
  {
   "amend": 1,
   "cancel": 1,
   "create": 1,
   "delete": 1,
   "email": 1,
   "export": 1,
   "import": 1,
   "print": 1,
   "read": 1,
   "report": 1,
   "role": "System Manager",
   "set_user_permissions": 1,
   "share": 1,
   "submit": 1,
   "write": 1
  },
  {
   "create": 1,
   "email": 1,
   "export": 1,
   "print": 1,
   "read": 1,
   "report": 1,
   "role": "Support Team",
   "share": 1,
   "submit": 1,
   "write": 1
  }
 ],
 "sort_field": "modified",
 "sort_order": "DESC",
 "title_field": "employee_name",
 "track_changes": 1
}