[
    {
     "allow_in_quick_entry": 0,
     "allow_on_submit": 0,
     "bold": 0,
     "collapsible": 0,
     "collapsible_depends_on": null,
     "columns": 0,
     "default": null,
     "depends_on": null,
     "description": null,
     "docstatus": 0,
     "doctype": "Custom Field",
     "dt": "Payment Entry",
     "fetch_from": null,
     "fetch_if_empty": 0,
     "fieldname": "excel_territory",
     "fieldtype": "Link",
     "hidden": 0,
     "ignore_user_permissions": 0,
     "ignore_xss_filter": 0,
     "in_global_search": 0,
     "in_list_view": 1,
     "in_standard_filter": 0,
     "insert_after": "type_of_payment",
     "label": "Territory",
     "length": 0,
     "modified": "2021-01-25 13:25:05.807120",
     "name": "Payment Entry-excel_territory",
     "no_copy": 0,
     "options": "Territory",
     "parent": null,
     "parentfield": null,
     "parenttype": null,
     "permlevel": 0,
     "precision": "",
     "print_hide": 0,
     "print_hide_if_no_value": 0,
     "print_width": null,
     "read_only": 0,
     "report_hide": 0,
     "reqd": 0,
     "search_index": 0,
     "translatable": 0,
     "unique": 0,
     "width": null
    },
    {
     "allow_in_quick_entry": 0,
     "allow_on_submit": 0,
     "bold": 0,
     "collapsible": 0,
     "collapsible_depends_on": null,
     "columns": 0,
     "default": null,
     "depends_on": null,
     "description": null,
     "docstatus": 0,
     "doctype": "Custom Field",
     "dt": "Bin",
     "fetch_from": "item_code.item_name",
     "fetch_if_empty": 0,
     "fieldname": "excel_item_name",
     "fieldtype": "Data",
     "hidden": 0,
     "ignore_user_permissions": 0,
     "ignore_xss_filter": 0,
     "in_global_search": 0,
     "in_list_view": 0,
     "in_standard_filter": 0,
     "insert_after": "item_code",
     "label": "Item Name",
     "length": 0,
     "modified": "2021-01-28 11:21:21.297798",
     "name": "Bin-excel_item_name",
     "no_copy": 0,
     "options": null,
     "parent": null,
     "parentfield": null,
     "parenttype": null,
     "permlevel": 0,
     "precision": "",
     "print_hide": 0,
     "print_hide_if_no_value": 0,
     "print_width": null,
     "read_only": 1,
     "report_hide": 0,
     "reqd": 0,
     "search_index": 0,
     "translatable": 0,
     "unique": 0,
     "width": null
    },
    {
     "allow_in_quick_entry": 0,
     "allow_on_submit": 0,
     "bold": 0,
     "collapsible": 0,
     "collapsible_depends_on": null,
     "columns": 0,
     "default": "Today",
     "depends_on": null,
     "description": null,
     "docstatus": 0,
     "doctype": "Custom Field",
     "dt": "Task",
     "fetch_from": null,
     "fetch_if_empty": 0,
     "fieldname": "excel_date",
     "fieldtype": "Date",
     "hidden": 0,
     "ignore_user_permissions": 0,
     "ignore_xss_filter": 0,
     "in_global_search": 0,
     "in_list_view": 1,
     "in_standard_filter": 0,
     "insert_after": "github_sync_id",
     "label": "Date",
     "length": 0,
     "modified": "2021-05-03 10:20:26.504981",
     "name": "Task-excel_date",
     "no_copy": 0,
     "options": null,
     "parent": null,
     "parentfield": null,
     "parenttype": null,
     "permlevel": 0,
     "precision": "",
     "print_hide": 0,
     "print_hide_if_no_value": 0,
     "print_width": null,
     "read_only": 1,
     "report_hide": 0,
     "reqd": 0,
     "search_index": 0,
     "translatable": 0,
     "unique": 0,
     "width": null
    },
    {
     "allow_in_quick_entry": 0,
     "allow_on_submit": 0,
     "bold": 0,
     "collapsible": 0,
     "collapsible_depends_on": null,
     "columns": 0,
     "default": null,
     "depends_on": null,
     "description": null,
     "docstatus": 0,
     "doctype": "Custom Field",
     "dt": "Payment Entry",
     "fetch_from": null,
     "fetch_if_empty": 0,
     "fieldname": "excel_tax_payment",
     "fieldtype": "Select",
     "hidden": 0,
     "ignore_user_permissions": 0,
     "ignore_xss_filter": 0,
     "in_global_search": 0,
     "in_list_view": 0,
     "in_standard_filter": 0,
     "insert_after": "excel_territory",
     "label": "Excel Tax Payment",
     "length": 0,
     "modified": "2021-01-25 13:25:11.176873",
     "name": "Payment Entry-excel_tax_payment",
     "no_copy": 0,
     "options": "No\nYes",
     "parent": null,
     "parentfield": null,
     "parenttype": null,
     "permlevel": 0,
     "precision": "",
     "print_hide": 0,
     "print_hide_if_no_value": 0,
     "print_width": null,
     "read_only": 0,
     "report_hide": 0,
     "reqd": 0,
     "search_index": 0,
     "translatable": 0,
     "unique": 0,
     "width": null
    },
    {
     "allow_in_quick_entry": 0,
     "allow_on_submit": 0,
     "bold": 0,
     "collapsible": 0,
     "collapsible_depends_on": null,
     "columns": 0,
     "default": null,
     "depends_on": null,
     "description": null,
     "docstatus": 0,
     "doctype": "Custom Field",
     "dt": "Journal Entry",
     "fetch_from": null,
     "fetch_if_empty": 0,
     "fieldname": "excel_territory",
     "fieldtype": "Link",
     "hidden": 0,
     "ignore_user_permissions": 0,
     "ignore_xss_filter": 0,
     "in_global_search": 0,
     "in_list_view": 0,
     "in_standard_filter": 0,
     "insert_after": "title",
     "label": "Territory",
     "length": 0,
     "modified": "2021-01-30 13:12:43.199784",
     "name": "Journal Entry-excel_territory",
     "no_copy": 0,
     "options": "Territory",
     "parent": null,
     "parentfield": null,
     "parenttype": null,
     "permlevel": 0,
     "precision": "",
     "print_hide": 0,
     "print_hide_if_no_value": 0,
     "print_width": null,
     "read_only": 0,
     "report_hide": 0,
     "reqd": 0,
     "search_index": 0,
     "translatable": 0,
     "unique": 0,
     "width": null
    },
    {
     "allow_in_quick_entry": 0,
     "allow_on_submit": 0,
     "bold": 0,
     "collapsible": 0,
     "collapsible_depends_on": null,
     "columns": 0,
     "default": null,
     "depends_on": null,
     "description": null,
     "docstatus": 0,
     "doctype": "Custom Field",
     "dt": "Bin",
     "fetch_from": "item_code.brand",
     "fetch_if_empty": 0,
     "fieldname": "excel_item_brand",
     "fieldtype": "Link",
     "hidden": 0,
     "ignore_user_permissions": 0,
     "ignore_xss_filter": 0,
     "in_global_search": 0,
     "in_list_view": 0,
     "in_standard_filter": 0,
     "insert_after": "excel_item_name",
     "label": "Item Brand",
     "length": 0,
     "modified": "2021-01-28 11:21:21.738860",
     "name": "Bin-excel_item_brand",
     "no_copy": 0,
     "options": "Brand",
     "parent": null,
     "parentfield": null,
     "parenttype": null,
     "permlevel": 0,
     "precision": "",
     "print_hide": 0,
     "print_hide_if_no_value": 0,
     "print_width": null,
     "read_only": 1,
     "report_hide": 0,
     "reqd": 0,
     "search_index": 0,
     "translatable": 0,
     "unique": 0,
     "width": null
    },
    {
     "allow_in_quick_entry": 0,
     "allow_on_submit": 0,
     "bold": 0,
     "collapsible": 0,
     "collapsible_depends_on": null,
     "columns": 0,
     "default": null,
     "depends_on": null,
     "description": null,
     "docstatus": 0,
     "doctype": "Custom Field",
     "dt": "Task",
     "fetch_from": null,
     "fetch_if_empty": 0,
     "fieldname": "excel_time",
     "fieldtype": "Time",
     "hidden": 0,
     "ignore_user_permissions": 0,
     "ignore_xss_filter": 0,
     "in_global_search": 0,
     "in_list_view": 1,
     "in_standard_filter": 0,
     "insert_after": "excel_date",
     "label": "Time",
     "length": 0,
     "modified": "2021-05-03 10:20:26.996448",
     "name": "Task-excel_time",
     "no_copy": 0,
     "options": null,
     "parent": null,
     "parentfield": null,
     "parenttype": null,
     "permlevel": 0,
     "precision": "",
     "print_hide": 0,
     "print_hide_if_no_value": 0,
     "print_width": null,
     "read_only": 1,
     "report_hide": 0,
     "reqd": 0,
     "search_index": 0,
     "translatable": 0,
     "unique": 0,
     "width": null
    },
    {
     "allow_in_quick_entry": 0,
     "allow_on_submit": 0,
     "bold": 0,
     "collapsible": 0,
     "collapsible_depends_on": null,
     "columns": 0,
     "default": null,
     "depends_on": null,
     "description": null,
     "docstatus": 0,
     "doctype": "Custom Field",
     "dt": "Stock Entry",
     "fetch_from": "",
     "fetch_if_empty": 0,
     "fieldname": "excel_territory",
     "fieldtype": "Link",
     "hidden": 0,
     "ignore_user_permissions": 0,
     "ignore_xss_filter": 0,
     "in_global_search": 0,
     "in_list_view": 0,
     "in_standard_filter": 0,
     "insert_after": "naming_series",
     "label": "Territory",
     "length": 0,
     "modified": "2021-02-05 22:13:32.575442",
     "name": "Stock Entry-excel_territory",
     "no_copy": 0,
     "options": "Territory",
     "parent": null,
     "parentfield": null,
     "parenttype": null,
     "permlevel": 0,
     "precision": "",
     "print_hide": 0,
     "print_hide_if_no_value": 0,
     "print_width": null,
     "read_only": 0,
     "report_hide": 0,
     "reqd": 0,
     "search_index": 0,
     "translatable": 0,
     "unique": 0,
     "width": null
    },
    {
     "allow_in_quick_entry": 0,
     "allow_on_submit": 0,
     "bold": 0,
     "collapsible": 0,
     "collapsible_depends_on": null,
     "columns": 0,
     "default": null,
     "depends_on": null,
     "description": null,
     "docstatus": 0,
     "doctype": "Custom Field",
     "dt": "Bin",
     "fetch_from": "item_code.item_group",
     "fetch_if_empty": 0,
     "fieldname": "excel_item_group",
     "fieldtype": "Link",
     "hidden": 0,
     "ignore_user_permissions": 0,
     "ignore_xss_filter": 0,
     "in_global_search": 0,
     "in_list_view": 0,
     "in_standard_filter": 0,
     "insert_after": "excel_item_brand",
     "label": "Item Group",
     "length": 0,
     "modified": "2021-01-28 11:21:22.128808",
     "name": "Bin-excel_item_group",
     "no_copy": 0,
     "options": "Item Group",
     "parent": null,
     "parentfield": null,
     "parenttype": null,
     "permlevel": 0,
     "precision": "",
     "print_hide": 0,
     "print_hide_if_no_value": 0,
     "print_width": null,
     "read_only": 1,
     "report_hide": 0,
     "reqd": 0,
     "search_index": 0,
     "translatable": 0,
     "unique": 0,
     "width": null
    },
    {
     "allow_in_quick_entry": 0,
     "allow_on_submit": 0,
     "bold": 0,
     "collapsible": 0,
     "collapsible_depends_on": null,
     "columns": 0,
     "default": null,
     "depends_on": "",
     "description": null,
     "docstatus": 0,
     "doctype": "Custom Field",
     "dt": "Purchase Order",
     "fetch_from": null,
     "fetch_if_empty": 0,
     "fieldname": "excel_actual_supplier",
     "fieldtype": "Link",
     "hidden": 0,
     "ignore_user_permissions": 0,
     "ignore_xss_filter": 0,
     "in_global_search": 0,
     "in_list_view": 0,
     "in_standard_filter": 0,
     "insert_after": "supplier",
     "label": "Actual Supplier",
     "length": 0,
     "modified": "2021-01-28 11:38:44.428930",
     "name": "Purchase Order-excel_actual_supplier",
     "no_copy": 0,
     "options": "Supplier",
     "parent": null,
     "parentfield": null,
     "parenttype": null,
     "permlevel": 0,
     "precision": "",
     "print_hide": 0,
     "print_hide_if_no_value": 0,
     "print_width": null,
     "read_only": 0,
     "report_hide": 0,
     "reqd": 0,
     "search_index": 0,
     "translatable": 0,
     "unique": 0,
     "width": null
    },
    {
     "allow_in_quick_entry": 0,
     "allow_on_submit": 0,
     "bold": 0,
     "collapsible": 0,
     "collapsible_depends_on": null,
     "columns": 0,
     "default": null,
     "depends_on": null,
     "description": null,
     "docstatus": 0,
     "doctype": "Custom Field",
     "dt": "Loan",
     "fetch_from": null,
     "fetch_if_empty": 0,
     "fieldname": "project",
     "fieldtype": "Link",
     "hidden": 0,
     "ignore_user_permissions": 0,
     "ignore_xss_filter": 0,
     "in_global_search": 0,
     "in_list_view": 0,
     "in_standard_filter": 0,
     "insert_after": "loan_type",
     "label": "Project",
     "length": 0,
     "modified": "2021-03-22 13:32:37.573446",
     "name": "Loan-project",
     "no_copy": 0,
     "options": "Project",
     "parent": null,
     "parentfield": null,
     "parenttype": null,
     "permlevel": 0,
     "precision": "",
     "print_hide": 0,
     "print_hide_if_no_value": 0,
     "print_width": null,
     "read_only": 0,
     "report_hide": 0,
     "reqd": 0,
     "search_index": 0,
     "translatable": 0,
     "unique": 0,
     "width": null
    },
    {
     "allow_in_quick_entry": 0,
     "allow_on_submit": 0,
     "bold": 0,
     "collapsible": 0,
     "collapsible_depends_on": null,
     "columns": 0,
     "default": null,
     "depends_on": null,
     "description": null,
     "docstatus": 0,
     "doctype": "Custom Field",
     "dt": "Issue",
     "fetch_from": "customer.customer_name",
     "fetch_if_empty": 0,
     "fieldname": "excel_customer_name",
     "fieldtype": "Data",
     "hidden": 0,
     "ignore_user_permissions": 0,
     "ignore_xss_filter": 0,
     "in_global_search": 0,
     "in_list_view": 0,
     "in_standard_filter": 0,
     "insert_after": "customer",
     "label": "Customer Name",
     "length": 0,
     "modified": "2021-05-03 10:21:38.788770",
     "name": "Issue-excel_customer_name",
     "no_copy": 0,
     "options": null,
     "parent": null,
     "parentfield": null,
     "parenttype": null,
     "permlevel": 0,
     "precision": "",
     "print_hide": 0,
     "print_hide_if_no_value": 0,
     "print_width": null,
     "read_only": 0,
     "report_hide": 0,
     "reqd": 0,
     "search_index": 0,
     "translatable": 0,
     "unique": 0,
     "width": null
    },
    {
     "allow_in_quick_entry": 0,
     "allow_on_submit": 0,
     "bold": 0,
     "collapsible": 0,
     "collapsible_depends_on": null,
     "columns": 0,
     "default": null,
     "depends_on": null,
     "description": null,
     "docstatus": 0,
     "doctype": "Custom Field",
     "dt": "Purchase Order",
     "fetch_from": "excel_actual_supplier.supplier_name",
     "fetch_if_empty": 0,
     "fieldname": "excel_actual_supplier_name",
     "fieldtype": "Data",
     "hidden": 0,
     "ignore_user_permissions": 0,
     "ignore_xss_filter": 0,
     "in_global_search": 0,
     "in_list_view": 1,
     "in_standard_filter": 0,
     "insert_after": "excel_actual_supplier",
     "label": "Actual Supplier Name",
     "length": 0,
     "modified": "2021-01-28 22:30:47.583407",
     "name": "Purchase Order-excel_actual_supplier_name",
     "no_copy": 0,
     "options": null,
     "parent": null,
     "parentfield": null,
     "parenttype": null,
     "permlevel": 0,
     "precision": "",
     "print_hide": 0,
     "print_hide_if_no_value": 0,
     "print_width": null,
     "read_only": 1,
     "report_hide": 0,
     "reqd": 0,
     "search_index": 0,
     "translatable": 0,
     "unique": 0,
     "width": null
    },
    {
     "allow_in_quick_entry": 0,
     "allow_on_submit": 0,
     "bold": 0,
     "collapsible": 0,
     "collapsible_depends_on": null,
     "columns": 0,
     "default": null,
     "depends_on": null,
     "description": null,
     "docstatus": 0,
     "doctype": "Custom Field",
     "dt": "Sales Invoice",
     "fetch_from": null,
     "fetch_if_empty": 0,
     "fieldname": "excel_customer_name_for_mps_print",
     "fieldtype": "Data",
     "hidden": 0,
     "ignore_user_permissions": 0,
     "ignore_xss_filter": 0,
     "in_global_search": 0,
     "in_list_view": 0,
     "in_standard_filter": 0,
     "insert_after": "customer_name",
     "label": "Customer Name for MPS Print",
     "length": 0,
     "modified": "2021-03-28 12:11:14.325050",
     "name": "Sales Invoice-excel_customer_name_for_mps_print",
     "no_copy": 0,
     "options": null,
     "parent": null,
     "parentfield": null,
     "parenttype": null,
     "permlevel": 0,
     "precision": "",
     "print_hide": 0,
     "print_hide_if_no_value": 0,
     "print_width": null,
     "read_only": 0,
     "report_hide": 0,
     "reqd": 0,
     "search_index": 0,
     "translatable": 0,
     "unique": 0,
     "width": null
    },
    {
     "allow_in_quick_entry": 0,
     "allow_on_submit": 0,
     "bold": 0,
     "collapsible": 0,
     "collapsible_depends_on": null,
     "columns": 0,
     "default": null,
     "depends_on": null,
     "description": null,
     "docstatus": 0,
     "doctype": "Custom Field",
     "dt": "Stock Entry",
     "fetch_from": null,
     "fetch_if_empty": 0,
     "fieldname": "excel_customer_name",
     "fieldtype": "Data",
     "hidden": 0,
     "ignore_user_permissions": 0,
     "ignore_xss_filter": 0,
     "in_global_search": 0,
     "in_list_view": 0,
     "in_standard_filter": 0,
     "insert_after": "stock_entry_type",
     "label": "Customer Name",
     "length": 0,
     "modified": "2021-03-28 14:01:11.427877",
     "name": "Stock Entry-excel_customer_name",
     "no_copy": 0,
     "options": null,
     "parent": null,
     "parentfield": null,
     "parenttype": null,
     "permlevel": 0,
     "precision": "",
     "print_hide": 0,
     "print_hide_if_no_value": 0,
     "print_width": null,
     "read_only": 0,
     "report_hide": 0,
     "reqd": 0,
     "search_index": 0,
     "translatable": 0,
     "unique": 0,
     "width": null
    },
    {
     "allow_in_quick_entry": 0,
     "allow_on_submit": 0,
     "bold": 0,
     "collapsible": 0,
     "collapsible_depends_on": null,
     "columns": 0,
     "default": null,
     "depends_on": null,
     "description": null,
     "docstatus": 0,
     "doctype": "Custom Field",
     "dt": "Issue",
     "fetch_from": null,
     "fetch_if_empty": 0,
     "fieldname": "excel_project",
     "fieldtype": "Link",
     "hidden": 0,
     "ignore_user_permissions": 0,
     "ignore_xss_filter": 0,
     "in_global_search": 0,
     "in_list_view": 0,
     "in_standard_filter": 0,
     "insert_after": "excel_customer_name",
     "label": "Project",
     "length": 0,
     "modified": "2021-05-03 10:05:44.953852",
     "name": "Issue-excel_project",
     "no_copy": 0,
     "options": "Project",
     "parent": null,
     "parentfield": null,
     "parenttype": null,
     "permlevel": 0,
     "precision": "",
     "print_hide": 0,
     "print_hide_if_no_value": 0,
     "print_width": null,
     "read_only": 0,
     "report_hide": 0,
     "reqd": 0,
     "search_index": 0,
     "translatable": 0,
     "unique": 0,
     "width": null
    },
    {
     "allow_in_quick_entry": 0,
     "allow_on_submit": 0,
     "bold": 0,
     "collapsible": 0,
     "collapsible_depends_on": null,
     "columns": 0,
     "default": null,
     "depends_on": null,
     "description": null,
     "docstatus": 0,
     "doctype": "Custom Field",
     "dt": "Task",
     "fetch_from": "excel_project",
     "fetch_if_empty": 0,
     "fieldname": "excel_project",
     "fieldtype": "Link",
     "hidden": 0,
     "ignore_user_permissions": 0,
     "ignore_xss_filter": 0,
     "in_global_search": 1,
     "in_list_view": 1,
     "in_standard_filter": 1,
     "insert_after": "project",
     "label": "Project",
     "length": 0,
     "modified": "2021-05-03 10:55:42.362055",
     "name": "Task-excel_project",
     "no_copy": 0,
     "options": "Project",
     "parent": null,
     "parentfield": null,
     "parenttype": null,
     "permlevel": 0,
     "precision": "",
     "print_hide": 0,
     "print_hide_if_no_value": 0,
     "print_width": null,
     "read_only": 0,
     "report_hide": 0,
     "reqd": 0,
     "search_index": 0,
     "translatable": 0,
     "unique": 0,
     "width": null
    },
    {
     "allow_in_quick_entry": 0,
     "allow_on_submit": 0,
     "bold": 0,
     "collapsible": 0,
     "collapsible_depends_on": null,
     "columns": 0,
     "default": null,
     "depends_on": null,
     "description": null,
     "docstatus": 0,
     "doctype": "Custom Field",
     "dt": "Purchase Order",
     "fetch_from": "excel_lc_no.pi_no",
     "fetch_if_empty": 0,
     "fieldname": "excel_pi_no",
     "fieldtype": "Data",
     "hidden": 0,
     "ignore_user_permissions": 0,
     "ignore_xss_filter": 0,
     "in_global_search": 0,
     "in_list_view": 0,
     "in_standard_filter": 0,
     "insert_after": "excel_actual_supplier_name",
     "label": "PI No",
     "length": 0,
     "modified": "2021-01-28 11:59:36.426801",
     "name": "Purchase Order-excel_pi_no",
     "no_copy": 0,
     "options": null,
     "parent": null,
     "parentfield": null,
     "parenttype": null,
     "permlevel": 0,
     "precision": "",
     "print_hide": 0,
     "print_hide_if_no_value": 0,
     "print_width": null,
     "read_only": 0,
     "report_hide": 0,
     "reqd": 0,
     "search_index": 0,
     "translatable": 0,
     "unique": 0,
     "width": null
    },
    {
     "allow_in_quick_entry": 0,
     "allow_on_submit": 0,
     "bold": 0,
     "collapsible": 0,
     "collapsible_depends_on": null,
     "columns": 0,
     "default": null,
     "depends_on": null,
     "description": null,
     "docstatus": 0,
     "doctype": "Custom Field",
     "dt": "Stock Entry",
     "fetch_from": null,
     "fetch_if_empty": 0,
     "fieldname": "excel_customer_address",
     "fieldtype": "Data",
     "hidden": 0,
     "ignore_user_permissions": 0,
     "ignore_xss_filter": 0,
     "in_global_search": 0,
     "in_list_view": 0,
     "in_standard_filter": 0,
     "insert_after": "excel_customer_name",
     "label": "Customer Address",
     "length": 0,
     "modified": "2021-03-28 14:01:11.957663",
     "name": "Stock Entry-excel_customer_address",
     "no_copy": 0,
     "options": null,
     "parent": null,
     "parentfield": null,
     "parenttype": null,
     "permlevel": 0,
     "precision": "",
     "print_hide": 0,
     "print_hide_if_no_value": 0,
     "print_width": null,
     "read_only": 0,
     "report_hide": 0,
     "reqd": 0,
     "search_index": 0,
     "translatable": 0,
     "unique": 0,
     "width": null
    },
    {
     "allow_in_quick_entry": 0,
     "allow_on_submit": 0,
     "bold": 0,
     "collapsible": 0,
     "collapsible_depends_on": null,
     "columns": 0,
     "default": null,
     "depends_on": null,
     "description": null,
     "docstatus": 0,
     "doctype": "Custom Field",
     "dt": "Issue",
     "fetch_from": null,
     "fetch_if_empty": 0,
     "fieldname": "excel_customer_contact_name",
     "fieldtype": "Data",
     "hidden": 0,
     "ignore_user_permissions": 0,
     "ignore_xss_filter": 0,
     "in_global_search": 0,
     "in_list_view": 0,
     "in_standard_filter": 0,
     "insert_after": "excel_project",
     "label": "Customer Contact Name",
     "length": 0,
     "modified": "2021-05-03 10:05:45.411902",
     "name": "Issue-excel_customer_contact_name",
     "no_copy": 0,
     "options": null,
     "parent": null,
     "parentfield": null,
     "parenttype": null,
     "permlevel": 0,
     "precision": "",
     "print_hide": 0,
     "print_hide_if_no_value": 0,
     "print_width": null,
     "read_only": 0,
     "report_hide": 0,
     "reqd": 0,
     "search_index": 0,
     "translatable": 0,
     "unique": 0,
     "width": null
    },
    {
     "allow_in_quick_entry": 0,
     "allow_on_submit": 0,
     "bold": 0,
     "collapsible": 0,
     "collapsible_depends_on": null,
     "columns": 0,
     "default": null,
     "depends_on": "",
     "description": null,
     "docstatus": 0,
     "doctype": "Custom Field",
     "dt": "Purchase Order",
     "fetch_from": "excel_lc_no.pi_date",
     "fetch_if_empty": 0,
     "fieldname": "excel_pi_date",
     "fieldtype": "Date",
     "hidden": 0,
     "ignore_user_permissions": 0,
     "ignore_xss_filter": 0,
     "in_global_search": 0,
     "in_list_view": 0,
     "in_standard_filter": 0,
     "insert_after": "excel_pi_no",
     "label": "PI Date",
     "length": 0,
     "modified": "2021-01-28 11:59:36.992756",
     "name": "Purchase Order-excel_pi_date",
     "no_copy": 0,
     "options": null,
     "parent": null,
     "parentfield": null,
     "parenttype": null,
     "permlevel": 0,
     "precision": "",
     "print_hide": 0,
     "print_hide_if_no_value": 0,
     "print_width": null,
     "read_only": 0,
     "report_hide": 0,
     "reqd": 0,
     "search_index": 0,
     "translatable": 0,
     "unique": 0,
     "width": null
    },
    {
     "allow_in_quick_entry": 0,
     "allow_on_submit": 0,
     "bold": 0,
     "collapsible": 0,
     "collapsible_depends_on": null,
     "columns": 0,
     "default": null,
     "depends_on": null,
     "description": null,
     "docstatus": 0,
     "doctype": "Custom Field",
     "dt": "Journal Entry Account",
     "fetch_from": "",
     "fetch_if_empty": 0,
     "fieldname": "excel_party_name",
     "fieldtype": "Data",
     "hidden": 0,
     "ignore_user_permissions": 0,
     "ignore_xss_filter": 0,
     "in_global_search": 0,
     "in_list_view": 0,
     "in_standard_filter": 0,
     "insert_after": "party",
     "label": "Party Name",
     "length": 0,
     "modified": "2021-02-11 15:30:58.228157",
     "name": "Journal Entry Account-excel_party_name",
     "no_copy": 0,
     "options": null,
     "parent": null,
     "parentfield": null,
     "parenttype": null,
     "permlevel": 0,
     "precision": "",
     "print_hide": 0,
     "print_hide_if_no_value": 0,
     "print_width": null,
     "read_only": 1,
     "report_hide": 0,
     "reqd": 0,
     "search_index": 0,
     "translatable": 0,
     "unique": 0,
     "width": null
    },
    {
     "allow_in_quick_entry": 0,
     "allow_on_submit": 0,
     "bold": 0,
     "collapsible": 0,
     "collapsible_depends_on": null,
     "columns": 0,
     "default": null,
     "depends_on": null,
     "description": null,
     "docstatus": 0,
     "doctype": "Custom Field",
     "dt": "Stock Entry",
     "fetch_from": null,
     "fetch_if_empty": 0,
     "fieldname": "excel_customer_contact",
     "fieldtype": "Data",
     "hidden": 0,
     "ignore_user_permissions": 0,
     "ignore_xss_filter": 0,
     "in_global_search": 0,
     "in_list_view": 0,
     "in_standard_filter": 0,
     "insert_after": "excel_customer_address",
     "label": "Customer Contact",
     "length": 0,
     "modified": "2021-03-28 14:01:12.463336",
     "name": "Stock Entry-excel_customer_contact",
     "no_copy": 0,
     "options": null,
     "parent": null,
     "parentfield": null,
     "parenttype": null,
     "permlevel": 0,
     "precision": "",
     "print_hide": 0,
     "print_hide_if_no_value": 0,
     "print_width": null,
     "read_only": 0,
     "report_hide": 0,
     "reqd": 0,
     "search_index": 0,
     "translatable": 0,
     "unique": 0,
     "width": null
    },
    {
     "allow_in_quick_entry": 0,
     "allow_on_submit": 0,
     "bold": 0,
     "collapsible": 0,
     "collapsible_depends_on": null,
     "columns": 0,
     "default": null,
     "depends_on": null,
     "description": null,
     "docstatus": 0,
     "doctype": "Custom Field",
     "dt": "Issue",
     "fetch_from": null,
     "fetch_if_empty": 0,
     "fieldname": "excel_customer_contact_number",
     "fieldtype": "Data",
     "hidden": 0,
     "ignore_user_permissions": 0,
     "ignore_xss_filter": 0,
     "in_global_search": 0,
     "in_list_view": 0,
     "in_standard_filter": 0,
     "insert_after": "excel_customer_contact_name",
     "label": "Customer Contact Number",
     "length": 0,
     "modified": "2021-05-03 10:05:45.825937",
     "name": "Issue-excel_customer_contact_number",
     "no_copy": 0,
     "options": null,
     "parent": null,
     "parentfield": null,
     "parenttype": null,
     "permlevel": 0,
     "precision": "",
     "print_hide": 0,
     "print_hide_if_no_value": 0,
     "print_width": null,
     "read_only": 0,
     "report_hide": 0,
     "reqd": 0,
     "search_index": 0,
     "translatable": 0,
     "unique": 0,
     "width": null
    },
    {
     "allow_in_quick_entry": 0,
     "allow_on_submit": 0,
     "bold": 0,
     "collapsible": 0,
     "collapsible_depends_on": null,
     "columns": 0,
     "default": null,
     "depends_on": null,
     "description": null,
     "docstatus": 0,
     "doctype": "Custom Field",
     "dt": "Task",
     "fetch_from": "issue.excel_customer_name",
     "fetch_if_empty": 0,
     "fieldname": "excel_customer_name",
     "fieldtype": "Data",
     "hidden": 0,
     "ignore_user_permissions": 0,
     "ignore_xss_filter": 0,
     "in_global_search": 0,
     "in_list_view": 0,
     "in_standard_filter": 1,
     "insert_after": "issue",
     "label": "Customer Name",
     "length": 0,
     "modified": "2021-05-03 10:23:51.685581",
     "name": "Task-excel_customer_name",
     "no_copy": 0,
     "options": null,
     "parent": null,
     "parentfield": null,
     "parenttype": null,
     "permlevel": 0,
     "precision": "",
     "print_hide": 0,
     "print_hide_if_no_value": 0,
     "print_width": null,
     "read_only": 0,
     "report_hide": 0,
     "reqd": 0,
     "search_index": 0,
     "translatable": 0,
     "unique": 0,
     "width": null
    },
    {
     "allow_in_quick_entry": 0,
     "allow_on_submit": 0,
     "bold": 0,
     "collapsible": 0,
     "collapsible_depends_on": null,
     "columns": 0,
     "default": null,
     "depends_on": null,
     "description": null,
     "docstatus": 0,
     "doctype": "Custom Field",
     "dt": "Customer",
     "fetch_from": null,
     "fetch_if_empty": 0,
     "fieldname": "excel_customer_bin_id",
     "fieldtype": "Data",
     "hidden": 0,
     "ignore_user_permissions": 0,
     "ignore_xss_filter": 0,
     "in_global_search": 0,
     "in_list_view": 0,
     "in_standard_filter": 0,
     "insert_after": "lead_name",
     "label": "Customer BIN ID",
     "length": 0,
     "modified": "2021-02-06 13:24:09.484282",
     "name": "Customer-excel_customer_bin_id",
     "no_copy": 0,
     "options": null,
     "parent": null,
     "parentfield": null,
     "parenttype": null,
     "permlevel": 0,
     "precision": "",
     "print_hide": 0,
     "print_hide_if_no_value": 0,
     "print_width": null,
     "read_only": 0,
     "report_hide": 0,
     "reqd": 0,
     "search_index": 0,
     "translatable": 0,
     "unique": 0,
     "width": null
    },
    {
     "allow_in_quick_entry": 0,
     "allow_on_submit": 0,
     "bold": 0,
     "collapsible": 0,
     "collapsible_depends_on": null,
     "columns": 0,
     "default": null,
     "depends_on": null,
     "description": "<b>If product is serialized, make sure to make it serialized on Portal.</b>",
     "docstatus": 0,
     "doctype": "Custom Field",
     "dt": "Item",
     "fetch_from": null,
     "fetch_if_empty": 0,
     "fieldname": "has_excel_serials",
     "fieldtype": "Select",
     "hidden": 0,
     "ignore_user_permissions": 0,
     "ignore_xss_filter": 0,
     "in_global_search": 0,
     "in_list_view": 0,
     "in_standard_filter": 0,
     "insert_after": "stock_uom",
     "label": "Has Excel Serials",
     "length": 0,
     "modified": "2021-02-05 22:15:57.580865",
     "name": "Item-has_excel_serials",
     "no_copy": 0,
     "options": "\nYes\nNo",
     "parent": null,
     "parentfield": null,
     "parenttype": null,
     "permlevel": 0,
     "precision": "",
     "print_hide": 0,
     "print_hide_if_no_value": 0,
     "print_width": null,
     "read_only": 0,
     "report_hide": 0,
     "reqd": 1,
     "search_index": 0,
     "translatable": 0,
     "unique": 0,
     "width": null
    },
    {
     "allow_in_quick_entry": 0,
     "allow_on_submit": 0,
     "bold": 0,
     "collapsible": 0,
     "collapsible_depends_on": null,
     "columns": 0,
     "default": null,
     "depends_on": null,
     "description": null,
     "docstatus": 0,
     "doctype": "Custom Field",
     "dt": "Stock Entry",
     "fetch_from": null,
     "fetch_if_empty": 0,
     "fieldname": "excel_customer_mobile",
     "fieldtype": "Data",
     "hidden": 0,
     "ignore_user_permissions": 0,
     "ignore_xss_filter": 0,
     "in_global_search": 0,
     "in_list_view": 0,
     "in_standard_filter": 0,
     "insert_after": "excel_customer_contact",
     "label": "Customer Mobile",
     "length": 0,
     "modified": "2021-03-28 14:01:13.024319",
     "name": "Stock Entry-excel_customer_mobile",
     "no_copy": 0,
     "options": null,
     "parent": null,
     "parentfield": null,
     "parenttype": null,
     "permlevel": 0,
     "precision": "",
     "print_hide": 0,
     "print_hide_if_no_value": 0,
     "print_width": null,
     "read_only": 0,
     "report_hide": 0,
     "reqd": 0,
     "search_index": 0,
     "translatable": 0,
     "unique": 0,
     "width": null
    },
    {
     "allow_in_quick_entry": 0,
     "allow_on_submit": 0,
     "bold": 0,
     "collapsible": 0,
     "collapsible_depends_on": null,
     "columns": 0,
     "default": null,
     "depends_on": null,
     "description": null,
     "docstatus": 0,
     "doctype": "Custom Field",
     "dt": "Task",
     "fetch_from": null,
     "fetch_if_empty": 0,
     "fieldname": "excel_customer_contact_name",
     "fieldtype": "Data",
     "hidden": 0,
     "ignore_user_permissions": 0,
     "ignore_xss_filter": 0,
     "in_global_search": 0,
     "in_list_view": 0,
     "in_standard_filter": 1,
     "insert_after": "excel_customer_name",
     "label": "Customer Contact Name",
     "length": 0,
     "modified": "2021-05-03 10:20:28.046403",
     "name": "Task-excel_customer_contact_name",
     "no_copy": 0,
     "options": null,
     "parent": null,
     "parentfield": null,
     "parenttype": null,
     "permlevel": 0,
     "precision": "",
     "print_hide": 0,
     "print_hide_if_no_value": 0,
     "print_width": null,
     "read_only": 0,
     "report_hide": 0,
     "reqd": 0,
     "search_index": 0,
     "translatable": 0,
     "unique": 0,
     "width": null
    },
    {
     "allow_in_quick_entry": 0,
     "allow_on_submit": 0,
     "bold": 0,
     "collapsible": 0,
     "collapsible_depends_on": null,
     "columns": 0,
     "default": null,
     "depends_on": null,
     "description": null,
     "docstatus": 0,
     "doctype": "Custom Field",
     "dt": "Customer",
     "fetch_from": null,
     "fetch_if_empty": 0,
     "fieldname": "excel_customer_trade_license",
     "fieldtype": "Data",
     "hidden": 0,
     "ignore_user_permissions": 0,
     "ignore_xss_filter": 0,
     "in_global_search": 0,
     "in_list_view": 0,
     "in_standard_filter": 0,
     "insert_after": "excel_customer_bin_id",
     "label": "Customer Trade License",
     "length": 0,
     "modified": "2021-02-06 13:24:09.937920",
     "name": "Customer-excel_customer_trade_license",
     "no_copy": 0,
     "options": null,
     "parent": null,
     "parentfield": null,
     "parenttype": null,
     "permlevel": 0,
     "precision": "",
     "print_hide": 0,
     "print_hide_if_no_value": 0,
     "print_width": null,
     "read_only": 0,
     "report_hide": 0,
     "reqd": 0,
     "search_index": 0,
     "translatable": 0,
     "unique": 0,
     "width": null
    },
    {
     "allow_in_quick_entry": 0,
     "allow_on_submit": 0,
     "bold": 0,
     "collapsible": 0,
     "collapsible_depends_on": null,
     "columns": 0,
     "default": null,
     "depends_on": null,
     "description": null,
     "docstatus": 0,
     "doctype": "Custom Field",
     "dt": "Asset",
     "fetch_from": "customer.customer_name",
     "fetch_if_empty": 0,
     "fieldname": "excel_customer_name",
     "fieldtype": "Data",
     "hidden": 0,
     "ignore_user_permissions": 0,
     "ignore_xss_filter": 0,
     "in_global_search": 0,
     "in_list_view": 0,
     "in_standard_filter": 0,
     "insert_after": "customer",
     "label": "Customer Name",
     "length": 0,
     "modified": "2021-02-09 17:12:09.192237",
     "name": "Asset-excel_customer_name",
     "no_copy": 0,
     "options": null,
     "parent": null,
     "parentfield": null,
     "parenttype": null,
     "permlevel": 0,
     "precision": "",
     "print_hide": 0,
     "print_hide_if_no_value": 0,
     "print_width": null,
     "read_only": 1,
     "report_hide": 0,
     "reqd": 0,
     "search_index": 0,
     "translatable": 0,
     "unique": 0,
     "width": null
    },
    {
     "allow_in_quick_entry": 0,
     "allow_on_submit": 0,
     "bold": 0,
     "collapsible": 0,
     "collapsible_depends_on": null,
     "columns": 0,
     "default": null,
     "depends_on": null,
     "description": null,
     "docstatus": 0,
     "doctype": "Custom Field",
     "dt": "Task",
     "fetch_from": null,
     "fetch_if_empty": 0,
     "fieldname": "excel_customer_contact_number",
     "fieldtype": "Data",
     "hidden": 0,
     "ignore_user_permissions": 0,
     "ignore_xss_filter": 0,
     "in_global_search": 0,
     "in_list_view": 0,
     "in_standard_filter": 0,
     "insert_after": "excel_customer_contact_name",
     "label": "Customer Contact Number",
     "length": 0,
     "modified": "2021-05-03 10:20:28.573334",
     "name": "Task-excel_customer_contact_number",
     "no_copy": 0,
     "options": null,
     "parent": null,
     "parentfield": null,
     "parenttype": null,
     "permlevel": 0,
     "precision": "",
     "print_hide": 0,
     "print_hide_if_no_value": 0,
     "print_width": null,
     "read_only": 0,
     "report_hide": 0,
     "reqd": 0,
     "search_index": 0,
     "translatable": 0,
     "unique": 0,
     "width": null
    },
    {
     "allow_in_quick_entry": 0,
     "allow_on_submit": 0,
     "bold": 0,
     "collapsible": 0,
     "collapsible_depends_on": null,
     "columns": 0,
     "default": null,
     "depends_on": null,
     "description": null,
     "docstatus": 0,
     "doctype": "Custom Field",
     "dt": "Purchase Invoice",
     "fetch_from": null,
     "fetch_if_empty": 0,
     "fieldname": "excel_supplier_invoice_no",
     "fieldtype": "Data",
     "hidden": 0,
     "ignore_user_permissions": 0,
     "ignore_xss_filter": 0,
     "in_global_search": 0,
     "in_list_view": 0,
     "in_standard_filter": 0,
     "insert_after": "tax_withholding_category",
     "label": "Supplier Invoice No",
     "length": 0,
     "modified": "2021-01-30 20:31:38.225367",
     "name": "Purchase Invoice-excel_supplier_invoice_no",
     "no_copy": 0,
     "options": null,
     "parent": null,
     "parentfield": null,
     "parenttype": null,
     "permlevel": 0,
     "precision": "",
     "print_hide": 0,
     "print_hide_if_no_value": 0,
     "print_width": null,
     "read_only": 0,
     "report_hide": 0,
     "reqd": 0,
     "search_index": 0,
     "translatable": 0,
     "unique": 0,
     "width": null
    },
    {
     "allow_in_quick_entry": 0,
     "allow_on_submit": 0,
     "bold": 0,
     "collapsible": 0,
     "collapsible_depends_on": null,
     "columns": 0,
     "default": null,
     "depends_on": null,
     "description": null,
     "docstatus": 0,
     "doctype": "Custom Field",
     "dt": "Customer",
     "fetch_from": null,
     "fetch_if_empty": 0,
     "fieldname": "excel_customer_nid",
     "fieldtype": "Data",
     "hidden": 0,
     "ignore_user_permissions": 0,
     "ignore_xss_filter": 0,
     "in_global_search": 0,
     "in_list_view": 0,
     "in_standard_filter": 0,
     "insert_after": "excel_customer_trade_license",
     "label": "Customer NID",
     "length": 0,
     "modified": "2021-02-06 13:24:10.404396",
     "name": "Customer-excel_customer_nid",
     "no_copy": 0,
     "options": null,
     "parent": null,
     "parentfield": null,
     "parenttype": null,
     "permlevel": 0,
     "precision": "",
     "print_hide": 0,
     "print_hide_if_no_value": 0,
     "print_width": null,
     "read_only": 0,
     "report_hide": 0,
     "reqd": 0,
     "search_index": 0,
     "translatable": 0,
     "unique": 0,
     "width": null
    },
    {
     "allow_in_quick_entry": 0,
     "allow_on_submit": 0,
     "bold": 0,
     "collapsible": 0,
     "collapsible_depends_on": null,
     "columns": 0,
     "default": null,
     "depends_on": null,
     "description": null,
     "docstatus": 0,
     "doctype": "Custom Field",
     "dt": "Asset",
     "fetch_from": null,
     "fetch_if_empty": 0,
     "fieldname": "excel_asset_user",
     "fieldtype": "Data",
     "hidden": 0,
     "ignore_user_permissions": 0,
     "ignore_xss_filter": 0,
     "in_global_search": 0,
     "in_list_view": 0,
     "in_standard_filter": 0,
     "insert_after": "excel_customer_name",
     "label": "Asset User",
     "length": 0,
     "modified": "2021-02-09 17:12:09.875286",
     "name": "Asset-excel_asset_user",
     "no_copy": 0,
     "options": null,
     "parent": null,
     "parentfield": null,
     "parenttype": null,
     "permlevel": 0,
     "precision": "",
     "print_hide": 0,
     "print_hide_if_no_value": 0,
     "print_width": null,
     "read_only": 0,
     "report_hide": 0,
     "reqd": 0,
     "search_index": 0,
     "translatable": 0,
     "unique": 0,
     "width": null
    },
    {
     "allow_in_quick_entry": 0,
     "allow_on_submit": 0,
     "bold": 0,
     "collapsible": 0,
     "collapsible_depends_on": null,
     "columns": 0,
     "default": null,
     "depends_on": null,
     "description": null,
     "docstatus": 0,
     "doctype": "Custom Field",
     "dt": "Asset",
     "fetch_from": null,
     "fetch_if_empty": 0,
     "fieldname": "project",
     "fieldtype": "Link",
     "hidden": 0,
     "ignore_user_permissions": 0,
     "ignore_xss_filter": 0,
     "in_global_search": 0,
     "in_list_view": 0,
     "in_standard_filter": 0,
     "insert_after": "excel_asset_user",
     "label": "Project",
     "length": 0,
     "modified": "2021-03-22 13:29:36.917733",
     "name": "Asset-project",
     "no_copy": 0,
     "options": "Project",
     "parent": null,
     "parentfield": null,
     "parenttype": null,
     "permlevel": 0,
     "precision": "",
     "print_hide": 0,
     "print_hide_if_no_value": 0,
     "print_width": null,
     "read_only": 0,
     "report_hide": 0,
     "reqd": 0,
     "search_index": 0,
     "translatable": 0,
     "unique": 0,
     "width": null
    },
    {
     "allow_in_quick_entry": 0,
     "allow_on_submit": 0,
     "bold": 0,
     "collapsible": 0,
     "collapsible_depends_on": null,
     "columns": 0,
     "default": null,
     "depends_on": null,
     "description": null,
     "docstatus": 0,
     "doctype": "Custom Field",
     "dt": "Task",
     "fetch_from": null,
     "fetch_if_empty": 0,
     "fieldname": "excel_service_address",
     "fieldtype": "Data",
     "hidden": 0,
     "ignore_user_permissions": 0,
     "ignore_xss_filter": 0,
     "in_global_search": 0,
     "in_list_view": 0,
     "in_standard_filter": 0,
     "insert_after": "excel_customer_contact_number",
     "label": "Service Address",
     "length": 0,
     "modified": "2021-05-03 10:20:29.096269",
     "name": "Task-excel_service_address",
     "no_copy": 0,
     "options": null,
     "parent": null,
     "parentfield": null,
     "parenttype": null,
     "permlevel": 0,
     "precision": "",
     "print_hide": 0,
     "print_hide_if_no_value": 0,
     "print_width": null,
     "read_only": 0,
     "report_hide": 0,
     "reqd": 0,
     "search_index": 0,
     "translatable": 0,
     "unique": 0,
     "width": null
    },
    {
     "allow_in_quick_entry": 0,
     "allow_on_submit": 0,
     "bold": 0,
     "collapsible": 0,
     "collapsible_depends_on": null,
     "columns": 0,
     "default": null,
     "depends_on": null,
     "description": null,
     "docstatus": 0,
     "doctype": "Custom Field",
     "dt": "Customer",
     "fetch_from": null,
     "fetch_if_empty": 0,
     "fieldname": "excel_security_cheque_amount",
     "fieldtype": "Float",
     "hidden": 0,
     "ignore_user_permissions": 0,
     "ignore_xss_filter": 0,
     "in_global_search": 0,
     "in_list_view": 0,
     "in_standard_filter": 0,
     "insert_after": "excel_customer_nid",
     "label": "Security Cheque Amount",
     "length": 0,
     "modified": "2021-02-14 17:14:42.249840",
     "name": "Customer-excel_security_cheque_amount",
     "no_copy": 0,
     "options": null,
     "parent": null,
     "parentfield": null,
     "parenttype": null,
     "permlevel": 0,
     "precision": "2",
     "print_hide": 0,
     "print_hide_if_no_value": 0,
     "print_width": null,
     "read_only": 0,
     "report_hide": 0,
     "reqd": 0,
     "search_index": 0,
     "translatable": 0,
     "unique": 0,
     "width": null
    },
    {
     "allow_in_quick_entry": 0,
     "allow_on_submit": 0,
     "bold": 0,
     "collapsible": 0,
     "collapsible_depends_on": null,
     "columns": 0,
     "default": null,
     "depends_on": null,
     "description": null,
     "docstatus": 0,
     "doctype": "Custom Field",
     "dt": "Task",
     "fetch_from": null,
     "fetch_if_empty": 0,
     "fieldname": "excel_assigned_user",
     "fieldtype": "Link",
     "hidden": 0,
     "ignore_user_permissions": 0,
     "ignore_xss_filter": 0,
     "in_global_search": 0,
     "in_list_view": 0,
     "in_standard_filter": 0,
     "insert_after": "type",
     "label": "Assigned User",
     "length": 0,
     "modified": "2021-05-03 10:20:29.615026",
     "name": "Task-excel_assigned_user",
     "no_copy": 0,
     "options": "User",
     "parent": null,
     "parentfield": null,
     "parenttype": null,
     "permlevel": 0,
     "precision": "",
     "print_hide": 0,
     "print_hide_if_no_value": 0,
     "print_width": null,
     "read_only": 0,
     "report_hide": 0,
     "reqd": 0,
     "search_index": 0,
     "translatable": 0,
     "unique": 0,
     "width": null
    },
    {
     "allow_in_quick_entry": 0,
     "allow_on_submit": 0,
     "bold": 0,
     "collapsible": 0,
     "collapsible_depends_on": null,
     "columns": 0,
     "default": null,
     "depends_on": null,
     "description": null,
     "docstatus": 0,
     "doctype": "Custom Field",
     "dt": "Employee Advance",
     "fetch_from": null,
     "fetch_if_empty": 0,
     "fieldname": "project",
     "fieldtype": "Link",
     "hidden": 0,
     "ignore_user_permissions": 0,
     "ignore_xss_filter": 0,
     "in_global_search": 0,
     "in_list_view": 0,
     "in_standard_filter": 0,
     "insert_after": "return_amount",
     "label": "Project",
     "length": 0,
     "modified": "2021-03-22 13:36:45.783059",
     "name": "Employee Advance-project",
     "no_copy": 0,
     "options": "Project",
     "parent": null,
     "parentfield": null,
     "parenttype": null,
     "permlevel": 0,
     "precision": "",
     "print_hide": 0,
     "print_hide_if_no_value": 0,
     "print_width": null,
     "read_only": 0,
     "report_hide": 0,
     "reqd": 0,
     "search_index": 0,
     "translatable": 0,
     "unique": 0,
     "width": null
    },
    {
     "allow_in_quick_entry": 0,
     "allow_on_submit": 0,
     "bold": 0,
     "collapsible": 0,
     "collapsible_depends_on": null,
     "columns": 0,
     "default": null,
     "depends_on": null,
     "description": null,
     "docstatus": 0,
     "doctype": "Custom Field",
     "dt": "Issue",
     "fetch_from": null,
     "fetch_if_empty": 0,
     "fieldname": "excel_team_name",
     "fieldtype": "Select",
     "hidden": 0,
     "ignore_user_permissions": 0,
     "ignore_xss_filter": 0,
     "in_global_search": 0,
     "in_list_view": 0,
     "in_standard_filter": 0,
     "insert_after": "issue_type",
     "label": "Team Name",
     "length": 0,
     "modified": "2021-05-03 10:05:46.308843",
     "name": "Issue-excel_team_name",
     "no_copy": 0,
     "options": "\nPrinting\nUnified Communication\nNetworks & Security Surveillance\nFire and Safety",
     "parent": null,
     "parentfield": null,
     "parenttype": null,
     "permlevel": 0,
     "precision": "",
     "print_hide": 0,
     "print_hide_if_no_value": 0,
     "print_width": null,
     "read_only": 0,
     "report_hide": 0,
     "reqd": 0,
     "search_index": 0,
     "translatable": 0,
     "unique": 0,
     "width": null
    },
    {
     "allow_in_quick_entry": 0,
     "allow_on_submit": 0,
     "bold": 0,
     "collapsible": 0,
     "collapsible_depends_on": null,
     "columns": 0,
     "default": null,
     "depends_on": null,
     "description": null,
     "docstatus": 0,
     "doctype": "Custom Field",
     "dt": "Task",
     "fetch_from": "excel_assigned_user.full_name",
     "fetch_if_empty": 0,
     "fieldname": "excel_user_name",
     "fieldtype": "Data",
     "hidden": 0,
     "ignore_user_permissions": 0,
     "ignore_xss_filter": 0,
     "in_global_search": 0,
     "in_list_view": 0,
     "in_standard_filter": 0,
     "insert_after": "excel_assigned_user",
     "label": "User Name",
     "length": 0,
     "modified": "2021-05-03 10:20:30.150275",
     "name": "Task-excel_user_name",
     "no_copy": 0,
     "options": null,
     "parent": null,
     "parentfield": null,
     "parenttype": null,
     "permlevel": 0,
     "precision": "",
     "print_hide": 0,
     "print_hide_if_no_value": 0,
     "print_width": null,
     "read_only": 1,
     "report_hide": 0,
     "reqd": 0,
     "search_index": 0,
     "translatable": 0,
     "unique": 0,
     "width": null
    },
    {
     "allow_in_quick_entry": 0,
     "allow_on_submit": 0,
     "bold": 0,
     "collapsible": 0,
     "collapsible_depends_on": null,
     "columns": 0,
     "default": null,
     "depends_on": null,
     "description": null,
     "docstatus": 0,
     "doctype": "Custom Field",
     "dt": "Issue",
     "fetch_from": null,
     "fetch_if_empty": 0,
     "fieldname": "excel_service_address",
     "fieldtype": "Data",
     "hidden": 0,
     "ignore_user_permissions": 0,
     "ignore_xss_filter": 0,
     "in_global_search": 0,
     "in_list_view": 0,
     "in_standard_filter": 0,
     "insert_after": "excel_team_name",
     "label": "Service Address",
     "length": 0,
     "modified": "2021-05-03 10:05:46.770082",
     "name": "Issue-excel_service_address",
     "no_copy": 0,
     "options": null,
     "parent": null,
     "parentfield": null,
     "parenttype": null,
     "permlevel": 0,
     "precision": "",
     "print_hide": 0,
     "print_hide_if_no_value": 0,
     "print_width": null,
     "read_only": 0,
     "report_hide": 0,
     "reqd": 0,
     "search_index": 0,
     "translatable": 0,
     "unique": 0,
     "width": null
    },
    {
     "allow_in_quick_entry": 0,
     "allow_on_submit": 0,
     "bold": 0,
     "collapsible": 0,
     "collapsible_depends_on": null,
     "columns": 0,
     "default": null,
     "depends_on": "",
     "description": null,
     "docstatus": 0,
     "doctype": "Custom Field",
     "dt": "Purchase Order",
     "fetch_from": null,
     "fetch_if_empty": 0,
     "fieldname": "excel_lc_no",
     "fieldtype": "Link",
     "hidden": 0,
     "ignore_user_permissions": 0,
     "ignore_xss_filter": 0,
     "in_global_search": 0,
     "in_list_view": 0,
     "in_standard_filter": 0,
     "insert_after": "order_confirmation_date",
     "label": "LC No",
     "length": 0,
     "modified": "2021-01-28 11:40:29.069342",
     "name": "Purchase Order-excel_lc_no",
     "no_copy": 0,
     "options": "Excel LC No",
     "parent": null,
     "parentfield": null,
     "parenttype": null,
     "permlevel": 0,
     "precision": "",
     "print_hide": 0,
     "print_hide_if_no_value": 0,
     "print_width": null,
     "read_only": 0,
     "report_hide": 0,
     "reqd": 0,
     "search_index": 0,
     "translatable": 0,
     "unique": 0,
     "width": null
    },
    {
     "allow_in_quick_entry": 0,
     "allow_on_submit": 0,
     "bold": 0,
     "collapsible": 0,
     "collapsible_depends_on": null,
     "columns": 0,
     "default": null,
     "depends_on": null,
     "description": null,
     "docstatus": 0,
     "doctype": "Custom Field",
     "dt": "Purchase Order",
     "fetch_from": "excel_lc_no.lc_date",
     "fetch_if_empty": 0,
     "fieldname": "excel_lc_date",
     "fieldtype": "Date",
     "hidden": 0,
     "ignore_user_permissions": 0,
     "ignore_xss_filter": 0,
     "in_global_search": 0,
     "in_list_view": 0,
     "in_standard_filter": 0,
     "insert_after": "excel_lc_no",
     "label": "LC Date",
     "length": 0,
     "modified": "2021-01-28 11:59:37.689593",
     "name": "Purchase Order-excel_lc_date",
     "no_copy": 0,
     "options": null,
     "parent": null,
     "parentfield": null,
     "parenttype": null,
     "permlevel": 0,
     "precision": "",
     "print_hide": 0,
     "print_hide_if_no_value": 0,
     "print_width": null,
     "read_only": 0,
     "report_hide": 0,
     "reqd": 0,
     "search_index": 0,
     "translatable": 0,
     "unique": 0,
     "width": null
    },
    {
     "allow_in_quick_entry": 0,
     "allow_on_submit": 0,
     "bold": 0,
     "collapsible": 0,
     "collapsible_depends_on": null,
     "columns": 0,
     "default": null,
     "depends_on": null,
     "description": null,
     "docstatus": 0,
     "doctype": "Custom Field",
     "dt": "Purchase Invoice",
     "fetch_from": null,
     "fetch_if_empty": 0,
     "fieldname": "excel_actual_supplier",
     "fieldtype": "Link",
     "hidden": 0,
     "ignore_user_permissions": 0,
     "ignore_xss_filter": 0,
     "in_global_search": 0,
     "in_list_view": 0,
     "in_standard_filter": 0,
     "insert_after": "set_posting_time",
     "label": "Actual Supplier",
     "length": 0,
     "modified": "2021-01-28 12:03:26.240970",
     "name": "Purchase Invoice-excel_actual_supplier",
     "no_copy": 0,
     "options": "Supplier",
     "parent": null,
     "parentfield": null,
     "parenttype": null,
     "permlevel": 0,
     "precision": "",
     "print_hide": 0,
     "print_hide_if_no_value": 0,
     "print_width": null,
     "read_only": 0,
     "report_hide": 0,
     "reqd": 0,
     "search_index": 0,
     "translatable": 0,
     "unique": 0,
     "width": null
    },
    {
     "allow_in_quick_entry": 0,
     "allow_on_submit": 0,
     "bold": 0,
     "collapsible": 0,
     "collapsible_depends_on": null,
     "columns": 0,
     "default": null,
     "depends_on": null,
     "description": null,
     "docstatus": 0,
     "doctype": "Custom Field",
     "dt": "Customer",
     "fetch_from": null,
     "fetch_if_empty": 0,
     "fieldname": "excel_customer_tin_id",
     "fieldtype": "Data",
     "hidden": 0,
     "ignore_user_permissions": 0,
     "ignore_xss_filter": 0,
     "in_global_search": 0,
     "in_list_view": 0,
     "in_standard_filter": 0,
     "insert_after": "territory",
     "label": "Customer TIN ID",
     "length": 0,
     "modified": "2021-02-14 12:30:28.094740",
     "name": "Customer-excel_customer_tin_id",
     "no_copy": 0,
     "options": null,
     "parent": null,
     "parentfield": null,
     "parenttype": null,
     "permlevel": 0,
     "precision": "",
     "print_hide": 0,
     "print_hide_if_no_value": 0,
     "print_width": null,
     "read_only": 0,
     "report_hide": 0,
     "reqd": 0,
     "search_index": 0,
     "translatable": 0,
     "unique": 0,
     "width": null
    },
    {
     "allow_in_quick_entry": 0,
     "allow_on_submit": 0,
     "bold": 0,
     "collapsible": 0,
     "collapsible_depends_on": null,
     "columns": 0,
     "default": null,
     "depends_on": null,
     "description": null,
     "docstatus": 0,
     "doctype": "Custom Field",
     "dt": "Purchase Invoice",
     "fetch_from": "excel_actual_supplier.supplier_name",
     "fetch_if_empty": 0,
     "fieldname": "excel_actual_supplier_name",
     "fieldtype": "Data",
     "hidden": 0,
     "ignore_user_permissions": 0,
     "ignore_xss_filter": 0,
     "in_global_search": 0,
     "in_list_view": 1,
     "in_standard_filter": 0,
     "insert_after": "excel_actual_supplier",
     "label": "Actual Supplier Name",
     "length": 0,
     "modified": "2021-01-30 13:15:39.554244",
     "name": "Purchase Invoice-excel_actual_supplier_name",
     "no_copy": 0,
     "options": null,
     "parent": null,
     "parentfield": null,
     "parenttype": null,
     "permlevel": 0,
     "precision": "",
     "print_hide": 0,
     "print_hide_if_no_value": 0,
     "print_width": null,
     "read_only": 1,
     "report_hide": 0,
     "reqd": 0,
     "search_index": 0,
     "translatable": 0,
     "unique": 0,
     "width": null
    },
    {
     "allow_in_quick_entry": 0,
     "allow_on_submit": 0,
     "bold": 0,
     "collapsible": 0,
     "collapsible_depends_on": null,
     "columns": 0,
     "default": null,
     "depends_on": null,
     "description": null,
     "docstatus": 0,
     "doctype": "Custom Field",
     "dt": "Purchase Order",
     "fetch_from": null,
     "fetch_if_empty": 0,
     "fieldname": "excel_supplier_invoice_no",
     "fieldtype": "Data",
     "hidden": 0,
     "ignore_user_permissions": 0,
     "ignore_xss_filter": 0,
     "in_global_search": 0,
     "in_list_view": 0,
     "in_standard_filter": 0,
     "insert_after": "excel_lc_date",
     "label": "Supplier Invoice No",
     "length": 0,
     "modified": "2021-01-30 20:29:47.884160",
     "name": "Purchase Order-excel_supplier_invoice_no",
     "no_copy": 0,
     "options": null,
     "parent": null,
     "parentfield": null,
     "parenttype": null,
     "permlevel": 0,
     "precision": "",
     "print_hide": 0,
     "print_hide_if_no_value": 0,
     "print_width": null,
     "read_only": 0,
     "report_hide": 0,
     "reqd": 0,
     "search_index": 0,
     "translatable": 0,
     "unique": 0,
     "width": null
    },
    {
     "allow_in_quick_entry": 0,
     "allow_on_submit": 0,
     "bold": 0,
     "collapsible": 0,
     "collapsible_depends_on": null,
     "columns": 0,
     "default": null,
     "depends_on": null,
     "description": null,
     "docstatus": 0,
     "doctype": "Custom Field",
     "dt": "Customer",
     "fetch_from": null,
     "fetch_if_empty": 0,
     "fieldname": "excel_customer_owner_name",
     "fieldtype": "Data",
     "hidden": 0,
     "ignore_user_permissions": 0,
     "ignore_xss_filter": 0,
     "in_global_search": 0,
     "in_list_view": 0,
     "in_standard_filter": 0,
     "insert_after": "excel_customer_tin_id",
     "label": "Customer Owner Name",
     "length": 0,
     "modified": "2021-02-14 12:30:28.887448",
     "name": "Customer-excel_customer_owner_name",
     "no_copy": 0,
     "options": null,
     "parent": null,
     "parentfield": null,
     "parenttype": null,
     "permlevel": 0,
     "precision": "",
     "print_hide": 0,
     "print_hide_if_no_value": 0,
     "print_width": null,
     "read_only": 0,
     "report_hide": 0,
     "reqd": 0,
     "search_index": 0,
     "translatable": 0,
     "unique": 0,
     "width": null
    },
    {
     "allow_in_quick_entry": 0,
     "allow_on_submit": 0,
     "bold": 0,
     "collapsible": 0,
     "collapsible_depends_on": null,
     "columns": 0,
     "default": null,
     "depends_on": null,
     "description": null,
     "docstatus": 0,
     "doctype": "Custom Field",
     "dt": "Project",
     "fetch_from": "",
     "fetch_if_empty": 0,
     "fieldname": "excel_mps_project_assets",
     "fieldtype": "Table",
     "hidden": 0,
     "ignore_user_permissions": 0,
     "ignore_xss_filter": 0,
     "in_global_search": 0,
     "in_list_view": 0,
     "in_standard_filter": 0,
     "insert_after": "excel_mps_assets",
     "label": "MPS Project Assets",
     "length": 0,
     "modified": "2021-02-16 13:11:09.912616",
     "name": "Project-excel_mps_project_assets",
     "no_copy": 0,
     "options": "Excel MPS Project Assets",
     "parent": null,
     "parentfield": null,
     "parenttype": null,
     "permlevel": 0,
     "precision": "",
     "print_hide": 0,
     "print_hide_if_no_value": 0,
     "print_width": null,
     "read_only": 0,
     "report_hide": 0,
     "reqd": 0,
     "search_index": 0,
     "translatable": 0,
     "unique": 0,
     "width": null
    },
    {
     "allow_in_quick_entry": 0,
     "allow_on_submit": 0,
     "bold": 0,
     "collapsible": 0,
     "collapsible_depends_on": null,
     "columns": 0,
     "default": null,
     "depends_on": null,
     "description": null,
     "docstatus": 0,
     "doctype": "Custom Field",
     "dt": "Purchase Invoice",
     "fetch_from": null,
     "fetch_if_empty": 0,
     "fieldname": "excel_lc_no",
     "fieldtype": "Link",
     "hidden": 0,
     "ignore_user_permissions": 0,
     "ignore_xss_filter": 0,
     "in_global_search": 0,
     "in_list_view": 0,
     "in_standard_filter": 0,
     "insert_after": "excel_actual_supplier_name",
     "label": "LC No",
     "length": 0,
     "modified": "2021-01-28 12:03:26.832819",
     "name": "Purchase Invoice-excel_lc_no",
     "no_copy": 0,
     "options": "Excel LC No",
     "parent": null,
     "parentfield": null,
     "parenttype": null,
     "permlevel": 0,
     "precision": "",
     "print_hide": 0,
     "print_hide_if_no_value": 0,
     "print_width": null,
     "read_only": 0,
     "report_hide": 0,
     "reqd": 0,
     "search_index": 0,
     "translatable": 0,
     "unique": 0,
     "width": null
    },
    {
     "allow_in_quick_entry": 0,
     "allow_on_submit": 0,
     "bold": 0,
     "collapsible": 0,
     "collapsible_depends_on": null,
     "columns": 0,
     "default": null,
     "depends_on": null,
     "description": null,
     "docstatus": 0,
     "doctype": "Custom Field",
     "dt": "Customer",
     "fetch_from": null,
     "fetch_if_empty": 0,
     "fieldname": "excel_customer_owner_farther_name",
     "fieldtype": "Data",
     "hidden": 0,
     "ignore_user_permissions": 0,
     "ignore_xss_filter": 0,
     "in_global_search": 0,
     "in_list_view": 0,
     "in_standard_filter": 0,
     "insert_after": "excel_customer_owner_name",
     "label": "Customer Owner Farther's Name",
     "length": 0,
     "modified": "2021-02-14 12:30:29.280421",
     "name": "Customer-excel_customer_owner_farther_name",
     "no_copy": 0,
     "options": null,
     "parent": null,
     "parentfield": null,
     "parenttype": null,
     "permlevel": 0,
     "precision": "",
     "print_hide": 0,
     "print_hide_if_no_value": 0,
     "print_width": null,
     "read_only": 0,
     "report_hide": 0,
     "reqd": 0,
     "search_index": 0,
     "translatable": 0,
     "unique": 0,
     "width": null
    },
    {
     "allow_in_quick_entry": 0,
     "allow_on_submit": 0,
     "bold": 0,
     "collapsible": 0,
     "collapsible_depends_on": null,
     "columns": 0,
     "default": null,
     "depends_on": null,
     "description": null,
     "docstatus": 0,
     "doctype": "Custom Field",
     "dt": "Purchase Invoice",
     "fetch_from": null,
     "fetch_if_empty": 0,
     "fieldname": "excel_lc_date",
     "fieldtype": "Date",
     "hidden": 0,
     "ignore_user_permissions": 0,
     "ignore_xss_filter": 0,
     "in_global_search": 0,
     "in_list_view": 0,
     "in_standard_filter": 0,
     "insert_after": "excel_lc_no",
     "label": "LC Date",
     "length": 0,
     "modified": "2021-01-28 12:03:27.500598",
     "name": "Purchase Invoice-excel_lc_date",
     "no_copy": 0,
     "options": null,
     "parent": null,
     "parentfield": null,
     "parenttype": null,
     "permlevel": 0,
     "precision": "",
     "print_hide": 0,
     "print_hide_if_no_value": 0,
     "print_width": null,
     "read_only": 0,
     "report_hide": 0,
     "reqd": 0,
     "search_index": 0,
     "translatable": 0,
     "unique": 0,
     "width": null
    },
    {
     "allow_in_quick_entry": 0,
     "allow_on_submit": 0,
     "bold": 0,
     "collapsible": 0,
     "collapsible_depends_on": null,
     "columns": 0,
     "default": null,
     "depends_on": null,
     "description": null,
     "docstatus": 0,
     "doctype": "Custom Field",
     "dt": "Customer",
     "fetch_from": null,
     "fetch_if_empty": 0,
     "fieldname": "excel_customer_owner_permanent_address",
     "fieldtype": "Data",
     "hidden": 0,
     "ignore_user_permissions": 0,
     "ignore_xss_filter": 0,
     "in_global_search": 0,
     "in_list_view": 0,
     "in_standard_filter": 0,
     "insert_after": "excel_customer_owner_farther_name",
     "label": "Customer Owner's Permanent Address",
     "length": 0,
     "modified": "2021-02-14 12:30:29.817698",
     "name": "Customer-excel_customer_owner_permanent_address",
     "no_copy": 0,
     "options": null,
     "parent": null,
     "parentfield": null,
     "parenttype": null,
     "permlevel": 0,
     "precision": "",
     "print_hide": 0,
     "print_hide_if_no_value": 0,
     "print_width": null,
     "read_only": 0,
     "report_hide": 0,
     "reqd": 0,
     "search_index": 0,
     "translatable": 0,
     "unique": 0,
     "width": null
    },
    {
     "allow_in_quick_entry": 0,
     "allow_on_submit": 0,
     "bold": 0,
     "collapsible": 0,
     "collapsible_depends_on": null,
     "columns": 0,
     "default": null,
     "depends_on": null,
     "description": null,
     "docstatus": 0,
     "doctype": "Custom Field",
     "dt": "Purchase Order",
     "fetch_from": null,
     "fetch_if_empty": 0,
     "fieldname": "excel_remarks",
     "fieldtype": "Small Text",
     "hidden": 0,
     "ignore_user_permissions": 0,
     "ignore_xss_filter": 0,
     "in_global_search": 0,
     "in_list_view": 0,
     "in_standard_filter": 0,
     "insert_after": "excel_supplier_invoice_date",
     "label": "Remarks",
     "length": 0,
     "modified": "2021-03-06 18:36:55.803199",
     "name": "Purchase Order-excel_remarks",
     "no_copy": 0,
     "options": null,
     "parent": null,
     "parentfield": null,
     "parenttype": null,
     "permlevel": 0,
     "precision": "",
     "print_hide": 0,
     "print_hide_if_no_value": 0,
     "print_width": null,
     "read_only": 0,
     "report_hide": 0,
     "reqd": 0,
     "search_index": 0,
     "translatable": 0,
     "unique": 0,
     "width": null
    },
    {
     "allow_in_quick_entry": 0,
     "allow_on_submit": 0,
     "bold": 0,
     "collapsible": 0,
     "collapsible_depends_on": null,
     "columns": 0,
     "default": null,
     "depends_on": null,
     "description": null,
     "docstatus": 0,
     "doctype": "Custom Field",
     "dt": "Task",
     "fetch_from": "issue.excel_team_name",
     "fetch_if_empty": 0,
     "fieldname": "excel_team_name",
     "fieldtype": "Select",
     "hidden": 0,
     "ignore_user_permissions": 0,
     "ignore_xss_filter": 0,
     "in_global_search": 0,
     "in_list_view": 1,
     "in_standard_filter": 1,
     "insert_after": "completed_by",
     "label": "Team Name",
     "length": 0,
     "modified": "2021-05-03 10:54:09.744584",
     "name": "Task-excel_team_name",
     "no_copy": 0,
     "options": "\nPrinting\nUnified Communication\nNetworks & Security Surveillance\nFire and Safety",
     "parent": null,
     "parentfield": null,
     "parenttype": null,
     "permlevel": 0,
     "precision": "",
     "print_hide": 0,
     "print_hide_if_no_value": 0,
     "print_width": null,
     "read_only": 0,
     "report_hide": 0,
     "reqd": 0,
     "search_index": 0,
     "translatable": 0,
     "unique": 0,
     "width": null
    },
    {
     "allow_in_quick_entry": 0,
     "allow_on_submit": 0,
     "bold": 0,
     "collapsible": 0,
     "collapsible_depends_on": null,
     "columns": 0,
     "default": null,
     "depends_on": null,
     "description": null,
     "docstatus": 0,
     "doctype": "Custom Field",
     "dt": "Purchase Invoice",
     "fetch_from": null,
     "fetch_if_empty": 0,
     "fieldname": "excel_pi_no",
     "fieldtype": "Data",
     "hidden": 0,
     "ignore_user_permissions": 0,
     "ignore_xss_filter": 0,
     "in_global_search": 0,
     "in_list_view": 0,
     "in_standard_filter": 0,
     "insert_after": "excel_lc_date",
     "label": "PI No",
     "length": 0,
     "modified": "2021-01-28 12:03:28.206487",
     "name": "Purchase Invoice-excel_pi_no",
     "no_copy": 0,
     "options": null,
     "parent": null,
     "parentfield": null,
     "parenttype": null,
     "permlevel": 0,
     "precision": "",
     "print_hide": 0,
     "print_hide_if_no_value": 0,
     "print_width": null,
     "read_only": 0,
     "report_hide": 0,
     "reqd": 0,
     "search_index": 0,
     "translatable": 0,
     "unique": 0,
     "width": null
    },
    {
     "allow_in_quick_entry": 0,
     "allow_on_submit": 0,
     "bold": 0,
     "collapsible": 0,
     "collapsible_depends_on": null,
     "columns": 0,
     "default": null,
     "depends_on": null,
     "description": null,
     "docstatus": 0,
     "doctype": "Custom Field",
     "dt": "Task",
     "fetch_from": null,
     "fetch_if_empty": 0,
     "fieldname": "excel_remarks",
     "fieldtype": "Text",
     "hidden": 0,
     "ignore_user_permissions": 0,
     "ignore_xss_filter": 0,
     "in_global_search": 0,
     "in_list_view": 0,
     "in_standard_filter": 0,
     "insert_after": "excel_team_name",
     "label": "Remarks",
     "length": 0,
     "modified": "2021-05-03 10:27:05.994070",
     "name": "Task-excel_remarks",
     "no_copy": 0,
     "options": null,
     "parent": null,
     "parentfield": null,
     "parenttype": null,
     "permlevel": 0,
     "precision": "",
     "print_hide": 0,
     "print_hide_if_no_value": 0,
     "print_width": null,
     "read_only": 0,
     "report_hide": 0,
     "reqd": 0,
     "search_index": 0,
     "translatable": 0,
     "unique": 0,
     "width": null
    },
    {
     "allow_in_quick_entry": 0,
     "allow_on_submit": 0,
     "bold": 0,
     "collapsible": 0,
     "collapsible_depends_on": null,
     "columns": 0,
     "default": null,
     "depends_on": null,
     "description": null,
     "docstatus": 0,
     "doctype": "Custom Field",
     "dt": "Purchase Invoice",
     "fetch_from": null,
     "fetch_if_empty": 0,
     "fieldname": "excel_pi_date",
     "fieldtype": "Date",
     "hidden": 0,
     "ignore_user_permissions": 0,
     "ignore_xss_filter": 0,
     "in_global_search": 0,
     "in_list_view": 0,
     "in_standard_filter": 0,
     "insert_after": "excel_pi_no",
     "label": "PI Date",
     "length": 0,
     "modified": "2021-01-28 12:03:28.875998",
     "name": "Purchase Invoice-excel_pi_date",
     "no_copy": 0,
     "options": null,
     "parent": null,
     "parentfield": null,
     "parenttype": null,
     "permlevel": 0,
     "precision": "",
     "print_hide": 0,
     "print_hide_if_no_value": 0,
     "print_width": null,
     "read_only": 0,
     "report_hide": 0,
     "reqd": 0,
     "search_index": 0,
     "translatable": 0,
     "unique": 0,
     "width": null
    },
    {
     "allow_in_quick_entry": 0,
     "allow_on_submit": 0,
     "bold": 0,
     "collapsible": 0,
     "collapsible_depends_on": null,
     "columns": 0,
     "default": null,
     "depends_on": null,
     "description": null,
     "docstatus": 0,
     "doctype": "Custom Field",
     "dt": "Task",
     "fetch_from": null,
     "fetch_if_empty": 0,
     "fieldname": "excel_assigned_user_2",
     "fieldtype": "Link",
     "hidden": 0,
     "ignore_user_permissions": 0,
     "ignore_xss_filter": 0,
     "in_global_search": 0,
     "in_list_view": 0,
     "in_standard_filter": 0,
     "insert_after": "excel_remarks",
     "label": "Assigned User 2",
     "length": 0,
     "modified": "2021-05-03 10:27:06.463368",
     "name": "Task-excel_assigned_user_2",
     "no_copy": 0,
     "options": "User",
     "parent": null,
     "parentfield": null,
     "parenttype": null,
     "permlevel": 0,
     "precision": "",
     "print_hide": 0,
     "print_hide_if_no_value": 0,
     "print_width": null,
     "read_only": 0,
     "report_hide": 0,
     "reqd": 0,
     "search_index": 0,
     "translatable": 0,
     "unique": 0,
     "width": null
    },
    {
     "allow_in_quick_entry": 0,
     "allow_on_submit": 0,
     "bold": 0,
     "collapsible": 0,
     "collapsible_depends_on": null,
     "columns": 0,
     "default": null,
     "depends_on": null,
     "description": null,
     "docstatus": 0,
     "doctype": "Custom Field",
     "dt": "Asset",
     "fetch_from": null,
     "fetch_if_empty": 0,
     "fieldname": "excel_device_model",
     "fieldtype": "Data",
     "hidden": 0,
     "ignore_user_permissions": 0,
     "ignore_xss_filter": 0,
     "in_global_search": 0,
     "in_list_view": 0,
     "in_standard_filter": 0,
     "insert_after": "purchase_receipt",
     "label": "Device Model",
     "length": 0,
     "modified": "2021-02-09 17:12:10.703397",
     "name": "Asset-excel_device_model",
     "no_copy": 0,
     "options": null,
     "parent": null,
     "parentfield": null,
     "parenttype": null,
     "permlevel": 0,
     "precision": "",
     "print_hide": 0,
     "print_hide_if_no_value": 0,
     "print_width": null,
     "read_only": 0,
     "report_hide": 0,
     "reqd": 0,
     "search_index": 0,
     "translatable": 0,
     "unique": 0,
     "width": null
    },
    {
     "allow_in_quick_entry": 0,
     "allow_on_submit": 0,
     "bold": 0,
     "collapsible": 0,
     "collapsible_depends_on": null,
     "columns": 0,
     "default": null,
     "depends_on": null,
     "description": null,
     "docstatus": 0,
     "doctype": "Custom Field",
     "dt": "Purchase Invoice",
     "fetch_from": null,
     "fetch_if_empty": 0,
     "fieldname": "excel_remarks",
     "fieldtype": "Small Text",
     "hidden": 0,
     "ignore_user_permissions": 0,
     "ignore_xss_filter": 0,
     "in_global_search": 0,
     "in_list_view": 0,
     "in_standard_filter": 0,
     "insert_after": "excel_pi_date",
     "label": "Excel Remarks",
     "length": 0,
     "modified": "2021-03-06 18:39:34.349800",
     "name": "Purchase Invoice-excel_remarks",
     "no_copy": 0,
     "options": null,
     "parent": null,
     "parentfield": null,
     "parenttype": null,
     "permlevel": 0,
     "precision": "",
     "print_hide": 0,
     "print_hide_if_no_value": 0,
     "print_width": null,
     "read_only": 0,
     "report_hide": 0,
     "reqd": 0,
     "search_index": 0,
     "translatable": 0,
     "unique": 0,
     "width": null
    },
    {
     "allow_in_quick_entry": 0,
     "allow_on_submit": 0,
     "bold": 0,
     "collapsible": 0,
     "collapsible_depends_on": null,
     "columns": 0,
     "default": null,
     "depends_on": null,
     "description": null,
     "docstatus": 0,
     "doctype": "Custom Field",
     "dt": "Task",
     "fetch_from": "excel_assigned_user_2.full_name",
     "fetch_if_empty": 0,
     "fieldname": "excel_assigned_user_name_2",
     "fieldtype": "Data",
     "hidden": 0,
     "ignore_user_permissions": 0,
     "ignore_xss_filter": 0,
     "in_global_search": 0,
     "in_list_view": 0,
     "in_standard_filter": 0,
     "insert_after": "excel_assigned_user_2",
     "label": "Assigned User Name 2",
     "length": 0,
     "modified": "2021-05-03 10:27:06.928549",
     "name": "Task-excel_assigned_user_name_2",
     "no_copy": 0,
     "options": null,
     "parent": null,
     "parentfield": null,
     "parenttype": null,
     "permlevel": 0,
     "precision": "",
     "print_hide": 0,
     "print_hide_if_no_value": 0,
     "print_width": null,
     "read_only": 1,
     "report_hide": 0,
     "reqd": 0,
     "search_index": 0,
     "translatable": 0,
     "unique": 0,
     "width": null
    },
    {
     "allow_in_quick_entry": 0,
     "allow_on_submit": 0,
     "bold": 0,
     "collapsible": 0,
     "collapsible_depends_on": null,
     "columns": 0,
     "default": null,
     "depends_on": null,
     "description": null,
     "docstatus": 0,
     "doctype": "Custom Field",
     "dt": "Asset",
     "fetch_from": null,
     "fetch_if_empty": 0,
     "fieldname": "excel_device_serial",
     "fieldtype": "Data",
     "hidden": 0,
     "ignore_user_permissions": 0,
     "ignore_xss_filter": 0,
     "in_global_search": 0,
     "in_list_view": 0,
     "in_standard_filter": 0,
     "insert_after": "excel_device_model",
     "label": "Device Serial",
     "length": 0,
     "modified": "2021-02-09 17:12:11.188286",
     "name": "Asset-excel_device_serial",
     "no_copy": 0,
     "options": null,
     "parent": null,
     "parentfield": null,
     "parenttype": null,
     "permlevel": 0,
     "precision": "",
     "print_hide": 0,
     "print_hide_if_no_value": 0,
     "print_width": null,
     "read_only": 0,
     "report_hide": 0,
     "reqd": 0,
     "search_index": 0,
     "translatable": 0,
     "unique": 0,
     "width": null
    },
    {
     "allow_in_quick_entry": 0,
     "allow_on_submit": 0,
     "bold": 0,
     "collapsible": 0,
     "collapsible_depends_on": null,
     "columns": 0,
     "default": null,
     "depends_on": null,
     "description": null,
     "docstatus": 0,
     "doctype": "Custom Field",
     "dt": "Journal Entry",
     "fetch_from": null,
     "fetch_if_empty": 0,
     "fieldname": "project",
     "fieldtype": "Link",
     "hidden": 0,
     "ignore_user_permissions": 0,
     "ignore_xss_filter": 0,
     "in_global_search": 0,
     "in_list_view": 0,
     "in_standard_filter": 0,
     "insert_after": "reference",
     "label": "Project",
     "length": 0,
     "modified": "2021-03-22 13:31:29.886496",
     "name": "Journal Entry-project",
     "no_copy": 0,
     "options": "Project",
     "parent": null,
     "parentfield": null,
     "parenttype": null,
     "permlevel": 0,
     "precision": "",
     "print_hide": 0,
     "print_hide_if_no_value": 0,
     "print_width": null,
     "read_only": 0,
     "report_hide": 0,
     "reqd": 0,
     "search_index": 0,
     "translatable": 0,
     "unique": 0,
     "width": null
    },
    {
     "allow_in_quick_entry": 0,
     "allow_on_submit": 0,
     "bold": 0,
     "collapsible": 0,
     "collapsible_depends_on": null,
     "columns": 0,
     "default": null,
     "depends_on": null,
     "description": null,
     "docstatus": 0,
     "doctype": "Custom Field",
     "dt": "Asset",
     "fetch_from": null,
     "fetch_if_empty": 0,
     "fieldname": "excel_remarks",
     "fieldtype": "Small Text",
     "hidden": 0,
     "ignore_user_permissions": 0,
     "ignore_xss_filter": 0,
     "in_global_search": 0,
     "in_list_view": 0,
     "in_standard_filter": 0,
     "insert_after": "excel_device_serial",
     "label": "Remarks",
     "length": 0,
     "modified": "2021-02-09 17:12:11.671559",
     "name": "Asset-excel_remarks",
     "no_copy": 0,
     "options": null,
     "parent": null,
     "parentfield": null,
     "parenttype": null,
     "permlevel": 0,
     "precision": "",
     "print_hide": 0,
     "print_hide_if_no_value": 0,
     "print_width": null,
     "read_only": 0,
     "report_hide": 0,
     "reqd": 0,
     "search_index": 0,
     "translatable": 0,
     "unique": 0,
     "width": null
    },
    {
     "allow_in_quick_entry": 0,
     "allow_on_submit": 0,
     "bold": 0,
     "collapsible": 0,
     "collapsible_depends_on": null,
     "columns": 0,
     "default": null,
     "depends_on": null,
     "description": null,
     "docstatus": 0,
     "doctype": "Custom Field",
     "dt": "Task",
     "fetch_from": null,
     "fetch_if_empty": 0,
     "fieldname": "excel_tasks_status",
     "fieldtype": "Table",
     "hidden": 0,
     "ignore_user_permissions": 0,
     "ignore_xss_filter": 0,
     "in_global_search": 0,
     "in_list_view": 0,
     "in_standard_filter": 0,
     "insert_after": "sb_details",
     "label": "Tasks Status",
     "length": 0,
     "modified": "2021-05-03 10:43:00.226111",
     "name": "Task-excel_tasks_status",
     "no_copy": 0,
     "options": "Excel Tasks Status",
     "parent": null,
     "parentfield": null,
     "parenttype": null,
     "permlevel": 0,
     "precision": "",
     "print_hide": 0,
     "print_hide_if_no_value": 0,
     "print_width": null,
     "read_only": 0,
     "report_hide": 0,
     "reqd": 0,
     "search_index": 0,
     "translatable": 0,
     "unique": 0,
     "width": null
    },
    {
     "allow_in_quick_entry": 0,
     "allow_on_submit": 0,
     "bold": 0,
     "collapsible": 0,
     "collapsible_depends_on": null,
     "columns": 0,
     "default": null,
     "depends_on": null,
     "description": null,
     "docstatus": 0,
     "doctype": "Custom Field",
     "dt": "Stock Entry Detail",
     "fetch_from": null,
     "fetch_if_empty": 0,
     "fieldname": "excel_serials",
     "fieldtype": "Long Text",
     "hidden": 0,
     "ignore_user_permissions": 0,
     "ignore_xss_filter": 0,
     "in_global_search": 0,
     "in_list_view": 0,
     "in_standard_filter": 0,
     "insert_after": "project",
     "label": "Excel Serials",
     "length": 0,
     "modified": "2021-01-25 13:23:13.387501",
     "name": "Stock Entry Detail-excel_serials",
     "no_copy": 0,
     "options": null,
     "parent": null,
     "parentfield": null,
     "parenttype": null,
     "permlevel": 0,
     "precision": "",
     "print_hide": 0,
     "print_hide_if_no_value": 0,
     "print_width": null,
     "read_only": 1,
     "report_hide": 0,
     "reqd": 0,
     "search_index": 0,
     "translatable": 0,
     "unique": 0,
     "width": null
    },
    {
     "allow_in_quick_entry": 0,
     "allow_on_submit": 0,
     "bold": 0,
     "collapsible": 0,
     "collapsible_depends_on": null,
     "columns": 0,
     "default": null,
     "depends_on": null,
     "description": null,
     "docstatus": 0,
     "doctype": "Custom Field",
     "dt": "Delivery Note Item",
     "fetch_from": null,
     "fetch_if_empty": 0,
     "fieldname": "excel_serials",
     "fieldtype": "Long Text",
     "hidden": 0,
     "ignore_user_permissions": 0,
     "ignore_xss_filter": 0,
     "in_global_search": 0,
     "in_list_view": 0,
     "in_standard_filter": 0,
     "insert_after": "page_break",
     "label": "Excel Serials",
     "length": 0,
     "modified": "2021-01-22 08:15:27.501540",
     "name": "Delivery Note Item-excel_serials",
     "no_copy": 0,
     "options": null,
     "parent": null,
     "parentfield": null,
     "parenttype": null,
     "permlevel": 0,
     "precision": "",
     "print_hide": 0,
     "print_hide_if_no_value": 0,
     "print_width": null,
     "read_only": 0,
     "report_hide": 0,
     "reqd": 0,
     "search_index": 0,
     "translatable": 0,
     "unique": 0,
     "width": null
    }
   ]