{
  "scan": {
    "scanner": {
      "id": "gemnasium-maven",
      "name": "gemnasium-maven",
      "url": "https://gitlab.com/gitlab-org/security-products/analyzers/gemnasium-maven",
      "vendor": {
        "name": "GitLab"
      },
      "version": "2.18.0"
    },
    "type": "dependency_scanning",
    "start_time": "2020-11-20T15:46:00",
    "end_time": "2020-11-20T15:57:06",
    "status": "success"
  }
}
