{
  "version": "v4",
  "repo": "borisyankov/DefinitelyTyped",
  "ref": "master",
  "path": "typings",
  "bundle": "typings/tsd.d.ts",
  "installed": {
    "jquery/jquery.d.ts": {
      "commit": "4c530f28d1e4bea629efe6232072889e3c6c93ac"
    },
    "requirejs/require.d.ts": {
      "commit": "43b79e1dd8e5f37eb37a64d329f967ad0cc33e56"
    },
    "knockout/knockout.d.ts": {
      "commit": "43b79e1dd8e5f37eb37a64d329f967ad0cc33e56"
    },
    "q/Q.d.ts": {
      "commit": "43b79e1dd8e5f37eb37a64d329f967ad0cc33e56"
    },
    "bootstrap/bootstrap.d.ts": {
      "commit": "43b79e1dd8e5f37eb37a64d329f967ad0cc33e56"
    },
    "bootstrap-maxlength/bootstrap-maxlength.d.ts": {
      "commit": "4c530f28d1e4bea629efe6232072889e3c6c93ac"
    },
    "gruntjs/gruntjs.d.ts": {
      "commit": "36d40a63a05b5cb3413737fbdf7c9a2a26f211fd"
    },
    "node/node.d.ts": {
      "commit": "36d40a63a05b5cb3413737fbdf7c9a2a26f211fd"
    }
  }
}
