﻿<svg height="0" xmlns="http://www.w3.org/2000/svg">
    <filter id="glow-shadow">
        <feGaussianBlur in="SourceAlpha" stdDeviation="6"/>
        <feOffset dx="0" dy="0" result="offsetblur"/>
        <feFlood flood-color="rgba(0,0,0,0.5)"/>
        <feComposite in2="offsetblur" operator="in"/>
        <feMerge>
            <feMergeNode/>
            <feMergeNode in="SourceGraphic"/>
        </feMerge>
    </filter>
    <filter id="drop-shadow">
        <feGaussianBlur in="SourceAlpha" stdDeviation="2"/>
        <feOffset dx="8" dy="8" result="offsetblur"/>
        <feFlood flood-color="#333" flood-opacity="0.65"/>
        <feComposite in2="offsetblur" operator="in"/>
        <feMerge>
            <feMergeNode/>
            <feMergeNode in="SourceGraphic"/>
        </feMerge>
    </filter>
</svg>