{
    "id": "S2_DNBR_20191201_20191231",
    "assets": {
        "data": {
            "title": "dNBR 2019-12-01/2019-12-31",
            "type": "image/tiff; application=geotiff",
            "href": "https://store.terradue.com/api/ogc-tb16/S2_DNBR_20191201_20191231.tif"
        }
    },
    "properties": {
        "datetime": "2019-12-31T00:02:41Z"
    },
    "links": [
        {
            "type": "application/json",
            "href": "http://terradue-ogctb16.gitlab.io/eoap/d169-jupyter-nb/stac-results/results/collection.json",
            "rel": "collection"
        },
        {
            "type": "application/json",
            "href": "http://terradue-ogctb16.gitlab.io/eoap/d169-jupyter-nb/stac-results/results/S2_DNBR_20191201_20191231/S2_DNBR_20191201_20191231.json",
            "rel": "self"
        },
        {
            "type": "application/json",
            "href": "http://terradue-ogctb16.gitlab.io/eoap/d169-jupyter-nb/stac-results/catalog.json",
            "rel": "root"
        },
        {
            "type": "application/json",
            "href": "http://terradue-ogctb16.gitlab.io/eoap/d169-jupyter-nb/stac-results/results/collection.json",
            "rel": "parent"
        }
    ],
    "stac_version": "0.8.1",
    "bbox": [
        149.701249152861,
        -35.3131554422379,
        150.932468533045,
        -34.2977254304893
    ],
    "geometry": {
        "type": "Polygon",
        "coordinates": [
            [
                [
                    150.907587083732,
                    -35.3131554422379
                ],
                [
                    150.932468533045,
                    -34.3236650991295
                ],
                [
                    149.740424607516,
                    -34.2977254304893
                ],
                [
                    149.701249152861,
                    -35.2862483718278
                ],
                [
                    150.907587083732,
                    -35.3131554422379
                ]
            ]
        ]
    },
    "type": "Feature",
    "collection": "results"
}