{
    "@context": "https://doi.org/10.5063/schema/codemeta-2.0",
    "@type": "SoftwareSourceCode",
    "license": "https://spdx.org/licenses/CC-BY-NC-SA-4.0",
    "dateCreated": "2022-09-01",
    "datePublished": "2022-09-25",
    "dateModified": "2022-09-25",
    "name": "Water Bodies Detection",
    "version": "1.0.0",
    "description": "The Water Bodies Detection is an Application Package that uses the NDWI index and the Otsu threshold to detect water bodies using Sentinel-2 data",
    "developmentStatus": "concept",
    "funder": {
        "@type": "Organization",
        "name": "OGC Testbed 18"
    },
    "keywords": [
        "NDWI"
    ],
    "programmingLanguage": [
        "Python",
        "CWL"
    ],
    "softwareRequirements": [
        "CWL runner, container runtime"
    ],
    "author": [
        {
            "@type": "Person",
            "givenName": "Jane",
            "familyName": "Doe",
            "email": "jane.doe@planet.earth"
        },
        {
            "@type": "Person",
            "givenName": "John",
            "familyName": "Doe",
            "email": "john.doe@planet.earth"
        }
    ]
}