{
  "project_info": {
    "project_number": "779889860817",
    "project_id": "shopsmart-f7b23",
    "storage_bucket": "shopsmart-f7b23.appspot.com"
  },
  "client": [
    {
      "client_info": {
        "mobilesdk_app_id": "1:779889860817:android:dc2af38064a06ce8f965f0",
        "android_client_info": {
          "package_name": "hr.ferit.shopsmart"
        }
      },
      "oauth_client": [
        {
          "client_id": "779889860817-v41g37n4g6lqhqu0v9fsekt9bhokuoia.apps.googleusercontent.com",
          "client_type": 3
        }
      ],
      "api_key": [
        {
          "current_key": "AIzaSyBbz8KWMDqXcJsDzwvZfNgN1_0XeFOY9vg"
        }
      ],
      "services": {
        "appinvite_service": {
          "other_platform_oauth_client": [
            {
              "client_id": "779889860817-v41g37n4g6lqhqu0v9fsekt9bhokuoia.apps.googleusercontent.com",
              "client_type": 3
            }
          ]
        }
      }
    }
  ],
  "configuration_version": "1"
}