GR.c:55:6:setValue	24	static
GR.c:61:6:assignValue	16	static
GR.c:71:6:equation	48	static
GR.c:78:9:min	32	static
GR.c:83:9:m_abs	16	static
GR.c:87:9:dtw	80	dynamic
GR.c:124:9:new_network	14496	static
GR.c:131:16:train_network	72	dynamic
GR.c:186:8:run_network	40	static
GR.c:211:6:GR_Calibration	32	static
GR.c:238:6:GR_data_acquisition	24	static
GR.c:243:6:GR_data_processing	40	static
GR.c:266:16:GR_add_gesture	16	static
GR.c:272:8:GR	16	static
GR.c:277:6:GR_Init	14496	static
