<svg xmlns="http://www.w3.org/2000/svg" viewBox="0 0 512 512" width="512" height="512">
    <defs>
        <filter id="shadow-2" height="300%" width="300%" x="-100%" y="-100%">
            <feFlood flood-color="rgba(0, 0, 0, 1)" result="flood"></feFlood>
            <feComposite in="flood" in2="SourceGraphic" operator="atop" result="composite"></feComposite>
            <feGaussianBlur in="composite" stdDeviation="15" result="blur"></feGaussianBlur>
            <feOffset dx="0" dy="0" result="offset"></feOffset>
            <feComposite in="SourceGraphic" in2="offset" operator="over"></feComposite>
        </filter>
        <filter id="shadow-3" height="300%" width="300%" x="-100%" y="-100%">
            <feFlood flood-color="rgba(0, 0, 0, 1)" result="flood"></feFlood>
            <feComposite in="flood" in2="SourceGraphic" operator="atop" result="composite"></feComposite>
            <feGaussianBlur in="composite" stdDeviation="15" result="blur"></feGaussianBlur>
            <feOffset dx="0" dy="0" result="offset"></feOffset>
            <feComposite in="SourceGraphic" in2="offset" operator="over"></feComposite>
        </filter>
        <filter id="shadow-4" height="300%" width="300%" x="-100%" y="-100%">
            <feFlood flood-color="rgba(0, 0, 0, 1)" result="flood"></feFlood>
            <feComposite in="flood" in2="SourceGraphic" operator="atop" result="composite"></feComposite>
            <feGaussianBlur in="composite" stdDeviation="15" result="blur"></feGaussianBlur>
            <feOffset dx="0" dy="0" result="offset"></feOffset>
            <feComposite in="SourceGraphic" in2="offset" operator="over"></feComposite>
        </filter>
        <radialGradient id="gradient-2">
            <stop offset="0%" stop-color="#f8e71c" stop-opacity="1"></stop>
            <stop offset="100%" stop-color="#f5a623" stop-opacity="1"></stop>
        </radialGradient>
        <radialGradient id="gradient-3">
            <stop offset="0%" stop-color="#f8e71c" stop-opacity="1"></stop>
            <stop offset="100%" stop-color="#f5a623" stop-opacity="1"></stop>
        </radialGradient>
        <radialGradient id="gradient-4">
            <stop offset="0%" stop-color="#f8e71c" stop-opacity="1"></stop>
            <stop offset="100%" stop-color="#f5a623" stop-opacity="1"></stop>
        </radialGradient>
    </defs>
    <rect fill="#2c4251" fill-opacity="1" height="512" width="512" rx="32" ry="32"></rect>
    <g class="" transform="translate(0,0)" style="touch-action: none;">
        <path
            d="M198.844 64.75c-.985 0-1.974.03-2.97.094-15.915 1.015-32.046 11.534-37.78 26.937-34.072 91.532-51.085 128.865-61.5 222.876 14.633 13.49 31.63 26.45 50.25 38.125l66.406-196.467 17.688 5.968L163.28 362.5c19.51 10.877 40.43 20.234 62 27.28l75.407-201.53 17.5 6.53-74.937 200.282c19.454 5.096 39.205 8.2 58.78 8.875L381.345 225.5l17.094 7.594-75.875 170.656c21.82-1.237 43.205-5.768 63.437-14.28 43.317-53.844 72.633-109.784 84.5-172.69 5.092-26.992-14.762-53.124-54.22-54.81l-6.155-.282-2.188-5.75c-8.45-22.388-19.75-30.093-31.5-32.47-11.75-2.376-25.267 1.535-35.468 7.376l-13.064 7.47-.906-15c-.99-16.396-10.343-29.597-24.313-35.626-13.97-6.03-33.064-5.232-54.812 9.906l-10.438 7.25-3.812-12.125c-6.517-20.766-20.007-27.985-34.78-27.97zM103.28 188.344C71.143 233.448 47.728 299.56 51.407 359.656c27.54 21.84 54.61 33.693 80.063 35.438 14.155.97 27.94-1.085 41.405-6.438-35.445-17.235-67.36-39.533-92.594-63.53l-3.343-3.157.5-4.595c5.794-54.638 13.946-91.5 25.844-129.03z"
            fill="#fff" fill-opacity="1"></path>
    </g>
</svg>