{
  "uuid": "f523a562-7557-11ea-b077-05b357765b88",
  "age": "",
  "professionOrTitle": "Muscle and Iron",
  "iconicFramework": "",
  "swade": true,
  "wildcard": true,
  "heavyArmor": false,
  "gender": "Male",
  "savagedUsShareURL": "https://savaged.us/s/lz442i71",
  "size": 2,
  "benniesMax": 3,
  "bennies": 3,
  "fatigueMax": 3,
  "fatigue": 0,
  "woundsMax": 3,
  "wounds": 0,
  "name": "Pineapple",
  "race": "Troll",
  "rank": 0,
  "rankName": "Novice",
  "imageToken": "https://savaged.us/data-images/characters/2845-14889-token.png",
  "image": "https://savaged.us/data-images/characters/2845-14889.jpg",
  "description": "Pineapple is not named after the fruit.  He is named after the grenade.  Keep this in mind when dealing with him.",
  "background": "He doesn't talk much about it.  Good luck figuring it out.  Mostly from the stories he tells his background is blowing things up, ripping things open and riddling things with bullets.",
  "attributes": [
    {
      "name": "agility",
      "value": "d4",
      "mod": 0,
      "dieValue": 4
    },
    {
      "name": "smarts",
      "value": "d4",
      "mod": 0,
      "dieValue": 4
    },
    {
      "name": "spirit",
      "value": "d4",
      "mod": 0,
      "dieValue": 4
    },
    {
      "name": "strength",
      "value": "d12",
      "mod": 0,
      "dieValue": 12
    },
    {
      "name": "vigor",
      "value": "d10",
      "mod": 0,
      "dieValue": 10
    }
  ],
  "toughnessBase": 7,
  "toughnessTotal": 18,
  "toughnessTotalNoArmor": 10,
  "toughnessMod": 3,
  "armorValue": 8,
  "parryBase": 6,
  "parryTotal": 9,
  "parryMod": 3,
  "paceBase": 6,
  "paceTotal": 5,
  "paceMod": -1,
  "runningDie": "d4",
  "sanity": 4,
  "skills": [
    {
      "name": "Athletics",
      "attribute": "agility",
      "value": "d4",
      "dieValue": 4,
      "mod": 0
    },
    {
      "name": "Common Knowledge",
      "attribute": "smarts",
      "value": "d4",
      "dieValue": 4,
      "mod": 0
    },
    {
      "name": "Fighting",
      "attribute": "agility",
      "value": "d8",
      "dieValue": 8,
      "mod": 0
    },
    {
      "name": "Intimidation",
      "attribute": "spirit",
      "value": "d4",
      "dieValue": 4,
      "mod": 0
    },
    {
      "name": "Language(Native)",
      "attribute": "smarts",
      "value": "d8",
      "dieValue": 8,
      "mod": 0
    },
    {
      "name": "Notice",
      "attribute": "smarts",
      "value": "d6",
      "dieValue": 6,
      "mod": 0
    },
    {
      "name": "Persuasion",
      "attribute": "spirit",
      "value": "d4-1",
      "dieValue": 4,
      "mod": -1
    },
    {
      "name": "Shooting",
      "attribute": "agility",
      "value": "d10",
      "dieValue": 10,
      "mod": 0
    },
    {
      "name": "Stealth",
      "attribute": "agility",
      "value": "d4",
      "dieValue": 4,
      "mod": 0
    },
    {
      "name": "Survival",
      "attribute": "smarts",
      "value": "d4",
      "dieValue": 4,
      "mod": 0
    }
  ],
  "edges": [
    {
      "name": "Brawny",
      "description": "Size (and therefore Toughness) +1. Treat Minimum Strength requirements as one die type less; treat Strength as one die type higher for Encumbrance.",
      "note": "Selected"
    }
  ],
  "hindrances": [
    {
      "name": "Can’t Swim (minor)",
      "description": "-2 to swimming (Athletics) rolls; Each inch moved in water costs 3” of Pace",
      "note": "Selected",
      "major": false
    },
    {
      "name": "Death Wish (minor)",
      "description": "The hero wants to die after or while completing some epic task",
      "note": "Selected",
      "major": false
    },
    {
      "name": "Loyal (minor)",
      "description": "The hero is loyal to his friends and allies",
      "note": "Selected",
      "major": false
    },
    {
      "name": "Ugly (minor)",
      "description": "The character is physically unattractive and subtracts 1 from Persuasion rolls",
      "note": "Selected",
      "major": false
    },
    {
      "name": "Vengeful (minor)",
      "description": "The adventurer seeks payback for slights against her. ",
      "note": "Selected",
      "major": false
    }
  ],
  "abilities": [
    {
      "name": "Infravision",
      "description": "The creature detects and “sees” heat, either through eyes or other sensory organs. This allows it to halve penalties for bad lighting when attacking targets that radiate heat.",
      "note": "Racial",
      "positive": 1,
      "from": "Racial"
    },
    {
      "name": "Toughness",
      "description": "The character has hardened skin, scales, or extremely dense tissue that increases his base Toughness by +1.",
      "note": "Racial",
      "positive": 1,
      "from": "Racial"
    },
    {
      "name": "Reach",
      "description": "Long limbs, tentacles, etc. grant the creature Reach +1 (add +1 each time it’s taken after the first).",
      "note": "Racial",
      "positive": 1,
      "from": "Racial"
    },
    {
      "name": "Horns (d4)",
      "description": "The being has a horn or horns that cause Str+d4 damage, Add +4 damage at the end of one Fighting action in which it Runs, moves at least 5′′(10 yards), and successfully hits with its horns.",
      "note": "Racial",
      "positive": 1,
      "from": "Racial"
    },
    {
      "name": "Big",
      "description": "The being is very large (he must also be least Size 2, see Size on page 105). He subtracts 2 when using equipment designed for smaller beings and cannot wear their armor or clothing. Equipment, armor, food, and clothing cost double the listed price.",
      "note": "Racial",
      "positive": 0,
      "from": "Racial"
    },
    {
      "name": "Reduced Pace (-1)",
      "description": "For –1 point, reduce Pace by 1 and the running die is a d4.",
      "note": "Racial",
      "positive": 0,
      "from": "Racial"
    },
    {
      "name": "Size +1",
      "description": "The creature is larger than normal. Each point of Size adds directly to Toughness. Large species may have difficulty using equipment designed for more traditional humanoids. See page 105 for more on Size.",
      "note": "Racial",
      "positive": 1,
      "from": "Racial"
    }
  ],
  "armor": [
    {
      "name": "Body Armor",
      "weight": 4,
      "quantity": 1,
      "armor": 4,
      "coversFace": false,
      "coversHead": false,
      "coversTorso": true,
      "coversLegs": true,
      "coversArms": true,
      "equipped": true,
      "cost": 200,
      "costBuy": 0,
      "minStr": "d4"
    },
    {
      "name": "Kevlar Riding Jacket",
      "weight": 8,
      "quantity": 1,
      "armor": 2,
      "coversFace": false,
      "coversHead": false,
      "coversTorso": true,
      "coversLegs": false,
      "coversArms": true,
      "equipped": true,
      "cost": 350,
      "costBuy": 0,
      "minStr": "d4"
    },
    {
      "name": "Kevlar Riding Jeans",
      "weight": 4,
      "quantity": 1,
      "armor": 2,
      "coversFace": false,
      "coversHead": false,
      "coversTorso": false,
      "coversLegs": true,
      "coversArms": false,
      "equipped": true,
      "cost": 175,
      "costBuy": 0,
      "minStr": "d4"
    },
    {
      "name": "Kevlar helmet",
      "weight": 5,
      "quantity": 1,
      "armor": 4,
      "coversFace": false,
      "coversHead": true,
      "coversTorso": false,
      "coversLegs": false,
      "coversArms": false,
      "equipped": true,
      "cost": 80,
      "costBuy": 0,
      "minStr": "d4"
    },
    {
      "name": "Kevlar vest with ceramic inserts (2008+ military issue)",
      "weight": 17,
      "quantity": 1,
      "armor": 6,
      "coversFace": false,
      "coversHead": false,
      "coversTorso": true,
      "coversLegs": false,
      "coversArms": false,
      "equipped": true,
      "cost": 500,
      "costBuy": 0,
      "minStr": "d8"
    },
    {
      "name": "Polymer Shield, large",
      "weight": 6,
      "quantity": 1,
      "armor": 0,
      "coversFace": false,
      "coversHead": false,
      "coversTorso": false,
      "coversLegs": false,
      "coversArms": false,
      "equipped": false,
      "cost": 400,
      "costBuy": 0,
      "minStr": "d4"
    }
  ],
  "gear": [
    {
      "name": "Boots, Hiking",
      "weight": 2,
      "quantity": 1,
      "contains": [],
      "notes": "",
      "equipped": false,
      "cost": 100,
      "costBuy": 0
    },
    {
      "name": "Bullet, Small ",
      "weight": 0.02,
      "quantity": 200,
      "contains": [],
      "notes": "",
      "equipped": false,
      "cost": 0.2,
      "costBuy": 0
    },
    {
      "name": "Crowbar",
      "weight": 2,
      "quantity": 1,
      "contains": [],
      "notes": "",
      "equipped": false,
      "cost": 10,
      "costBuy": 0
    },
    {
      "name": "First Aid Kit (basic supplies)",
      "weight": 1,
      "quantity": 1,
      "contains": [],
      "notes": "",
      "equipped": false,
      "cost": 10,
      "costBuy": 0
    },
    {
      "name": "Goggles",
      "weight": 1,
      "quantity": 1,
      "contains": [],
      "notes": "",
      "equipped": false,
      "cost": 20,
      "costBuy": 0
    },
    {
      "name": "Laser Sight",
      "weight": 1,
      "quantity": 1,
      "contains": [],
      "notes": "",
      "equipped": false,
      "cost": 150,
      "costBuy": 0
    },
    {
      "name": "Shotgun slug",
      "weight": 0.06,
      "quantity": 100,
      "contains": [],
      "notes": "",
      "equipped": false,
      "cost": 0.8,
      "costBuy": 0
    }
  ],
  "weapons": [
    {
      "name": "Unarmed",
      "weight": 0,
      "range": "Melee",
      "damage": "Str",
      "rof": 0,
      "shots": 0,
      "ap": 0,
      "notes": "Innate Attack",
      "thrown": false,
      "quantity": 1,
      "reach": 0,
      "innate": true,
      "damageDiceBase": "1d6+1d12--1d4",
      "damageDiceBasePlus": 4,
      "equipped": false,
      "cost": 0,
      "costBuy": 0,
      "minStr": ""
    },
    {
      "name": "Horns",
      "weight": 0,
      "range": "Melee",
      "damage": "Str+d4",
      "rof": 0,
      "shots": 0,
      "ap": 0,
      "notes": "Innate Attack",
      "thrown": false,
      "quantity": 1,
      "reach": 0,
      "innate": true,
      "damageDiceBase": "1d6+1d12--1d4",
      "damageDiceBasePlus": 4,
      "equipped": false,
      "cost": 0,
      "costBuy": 0,
      "minStr": ""
    },
    {
      "name": "Colt Peacemaker (.45)",
      "weight": 4,
      "range": "12/24/48",
      "damage": "2d6+1",
      "rof": 1,
      "shots": 6,
      "ap": 0,
      "notes": "",
      "thrown": false,
      "quantity": 1,
      "reach": 0,
      "innate": false,
      "damageDiceBase": "1d6+1d12--1d4",
      "damageDiceBasePlus": 4,
      "equipped": false,
      "cost": 200,
      "costBuy": 0,
      "minStr": "d4"
    },
    {
      "name": "M60 (7.62)",
      "weight": 33,
      "range": "30/60/120",
      "damage": "2d8+1",
      "rof": 3,
      "shots": 100,
      "ap": 2,
      "notes": " Min ROF 2",
      "thrown": false,
      "quantity": 1,
      "reach": 0,
      "innate": false,
      "damageDiceBase": "1d6+1d12--1d4",
      "damageDiceBasePlus": 4,
      "equipped": false,
      "cost": 6000,
      "costBuy": 0,
      "minStr": "d8"
    },
    {
      "name": "Mk II (WW2 Pineapple)",
      "weight": 1,
      "range": "4/8/16",
      "damage": "3d6",
      "rof": 1,
      "shots": 1,
      "ap": 0,
      "notes": "MBT",
      "thrown": false,
      "quantity": 10,
      "reach": 0,
      "innate": false,
      "damageDiceBase": "1d6+1d12--1d4",
      "damageDiceBasePlus": 4,
      "equipped": false,
      "cost": 40,
      "costBuy": 0,
      "minStr": "d4"
    },
    {
      "name": "Molecular Battle Axe",
      "weight": 3,
      "range": "Melee",
      "damage": "Str+d8+4",
      "rof": 0,
      "shots": 0,
      "ap": 4,
      "notes": "",
      "thrown": false,
      "quantity": 1,
      "reach": 0,
      "innate": false,
      "damageDiceBase": "1d6+1d12--1d4",
      "damageDiceBasePlus": 4,
      "equipped": false,
      "cost": 500,
      "costBuy": 500,
      "minStr": "d8"
    },
    {
      "name": "Molecular Knife",
      "weight": 0.5,
      "range": "Melee",
      "damage": "Str+d4+2",
      "rof": 0,
      "shots": 0,
      "ap": 2,
      "notes": " Cannot be thrown",
      "thrown": false,
      "quantity": 1,
      "reach": 0,
      "innate": false,
      "damageDiceBase": "1d6+1d12--1d4",
      "damageDiceBasePlus": 4,
      "equipped": false,
      "cost": 250,
      "costBuy": 0,
      "minStr": "d4"
    },
    {
      "name": "Molecular Sword",
      "weight": 2,
      "range": "Melee",
      "damage": "Str+d8+2",
      "rof": 0,
      "shots": 0,
      "ap": 4,
      "notes": "",
      "thrown": false,
      "quantity": 1,
      "reach": 0,
      "innate": false,
      "damageDiceBase": "1d6+1d12--1d4",
      "damageDiceBasePlus": 4,
      "equipped": false,
      "cost": 500,
      "costBuy": 0,
      "minStr": "d6"
    },
    {
      "name": "Smoke Grenade",
      "weight": 1,
      "range": "5/1-/2-",
      "damage": "-",
      "rof": 1,
      "shots": 1,
      "ap": 0,
      "notes": "Creates an area of smoke in a LBT that obscures vision (–4).",
      "thrown": false,
      "quantity": 10,
      "reach": 0,
      "innate": false,
      "damageDiceBase": "1d6+1d12--1d4",
      "damageDiceBasePlus": 4,
      "equipped": false,
      "cost": 50,
      "costBuy": 0,
      "minStr": "d4"
    },
    {
      "name": "Streetsweeper Shotgun",
      "weight": 10,
      "range": "12/24/48",
      "damage": "1-3d6",
      "rof": 1,
      "shots": 12,
      "ap": 0,
      "notes": "",
      "thrown": false,
      "quantity": 1,
      "reach": 0,
      "innate": false,
      "damageDiceBase": "1d6+1d12--1d4",
      "damageDiceBasePlus": 4,
      "equipped": false,
      "cost": 450,
      "costBuy": 0,
      "minStr": "d4"
    },
    {
      "name": "Stun Grenade",
      "weight": 1,
      "range": "5/10/20",
      "damage": "-",
      "rof": 1,
      "shots": 1,
      "ap": 0,
      "notes": "Targets must make a Vigor roll (at –2 with a raise) or be Stunned (see page 106).",
      "thrown": false,
      "quantity": 10,
      "reach": 0,
      "innate": false,
      "damageDiceBase": "1d6+1d12--1d4",
      "damageDiceBasePlus": 4,
      "equipped": false,
      "cost": 50,
      "costBuy": 0,
      "minStr": "d4"
    }
  ],
  "cyberware": [
    {
      "name": "Cyberjack",
      "ranks": 1,
      "quantity": 1,
      "notes": "",
      "strain": 1,
      "cost": 3000,
      "costBuy": 0
    },
    {
      "name": "SmartGun Link",
      "ranks": 1,
      "quantity": 1,
      "notes": "Aids Aiming and provides HUD with gun info like ammo, temp, etc",
      "strain": 1,
      "cost": 2000,
      "costBuy": 0
    }
  ],
  "useCharisma": false,
  "charisma": 0,
  "xp": 0,
  "usesXP": false,
  "advancesCount": 0,
  "advances": [],
  "abs": [],
  "languages": [
    {
      "name": "Language(Native)",
      "attribute": "smarts",
      "value": "d8",
      "dieValue": 8,
      "mod": 0
    }
  ],
  "loadLimit": 120,
  "loadLimitBase": 100,
  "load": 116.5,
  "loadLimitModifier": 20,
  "wealth": 0,
  "journal": []
}