{
  "uuid": "d55df380-a030-11ea-8125-71b1ad8856f6",
  "swade": true,
  "wildcard": true,
  "heavyArmor": false,
  "gender": "Male",
  "savagedUsShareURL": "https://savaged.us/s/oxlzze2a",
  "size": 0,
  "benniesMax": 4,
  "bennies": 4,
  "fatigueMax": 3,
  "fatigue": 0,
  "woundsMax": 3,
  "wounds": 0,
  "name": "Lug",
  "race": "Human",
  "rank": 0,
  "rankName": "Novice",
  "imageToken": "https://savaged.us/data-images/characters/2845-16624-token.png",
  "image": "https://savaged.us/data-images/characters/2845-16624.jpg",
  "description": "Extrovert and weirdo. Loves tech sooo much.  Also RPGs.  And comics.",
  "background": "Good looking and knows it. Grew up in the Chicago sprawl.  Knows a lot of crappy fixers.  Drives a ancient Harley with a custom partial rig adaptation that, as he puts it 'Gives me all the good sensations'.  If you need something driven or flown he's a guy you want around.  If you can stand all the talking.  All the talky talking.",
  "attributes": [
    {
      "name": "agility",
      "value": "d10",
      "mod": 0,
      "dieValue": 10
    },
    {
      "name": "smarts",
      "value": "d6",
      "mod": 0,
      "dieValue": 6
    },
    {
      "name": "spirit",
      "value": "d4",
      "mod": 0,
      "dieValue": 4
    },
    {
      "name": "strength",
      "value": "d6",
      "mod": 0,
      "dieValue": 6
    },
    {
      "name": "vigor",
      "value": "d6",
      "mod": 0,
      "dieValue": 6
    }
  ],
  "toughnessBase": 5,
  "toughnessTotal": 5,
  "toughnessTotalNoArmor": 5,
  "toughnessMod": 0,
  "armorValue": 0,
  "parryBase": 2,
  "parryTotal": 2,
  "parryMod": 0,
  "paceBase": 6,
  "paceTotal": 6,
  "paceMod": 0,
  "runningDie": "d6",
  "sanity": 4,
  "skills": [
    {
      "name": "Athletics",
      "attribute": "agility",
      "value": "d4",
      "dieValue": 4,
      "mod": 0
    },
    {
      "name": "Common Knowledge",
      "attribute": "smarts",
      "value": "d4",
      "dieValue": 4,
      "mod": 0
    },
    {
      "name": "Driving",
      "attribute": "agility",
      "value": "d10",
      "dieValue": 10,
      "mod": 0
    },
    {
      "name": "Electronics",
      "attribute": "smarts",
      "value": "d4",
      "dieValue": 4,
      "mod": 0
    },
    {
      "name": "Hacking",
      "attribute": "smarts",
      "value": "d4",
      "dieValue": 4,
      "mod": 0
    },
    {
      "name": "Language(Native)",
      "attribute": "smarts",
      "value": "d8",
      "dieValue": 8,
      "mod": 0
    },
    {
      "name": "Notice",
      "attribute": "smarts",
      "value": "d4",
      "dieValue": 4,
      "mod": 0
    },
    {
      "name": "Persuasion",
      "attribute": "spirit",
      "value": "d4+1",
      "dieValue": 4,
      "mod": 1
    },
    {
      "name": "Piloting",
      "attribute": "agility",
      "value": "d8",
      "dieValue": 8,
      "mod": 0
    },
    {
      "name": "Riding",
      "attribute": "agility",
      "value": "d4",
      "dieValue": 4,
      "mod": 0
    },
    {
      "name": "Shooting",
      "attribute": "agility",
      "value": "d12",
      "dieValue": 12,
      "mod": 0
    },
    {
      "name": "Stealth",
      "attribute": "agility",
      "value": "d4",
      "dieValue": 4,
      "mod": 0
    }
  ],
  "edges": [
    {
      "name": "Ace",
      "description": "Ignore two points of penalties to any Boating, Driving, or Piloting roll. Spend Bennies to Soak damage for any vehicle they control",
      "note": "Selected"
    },
    {
      "name": "Attractive",
      "description": "+1 to Persuasion rolls.",
      "note": "Selected"
    },
    {
      "name": "Luck",
      "description": "+1 Benny at the start of each session.",
      "note": "Selected"
    }
  ],
  "hindrances": [
    {
      "name": "Big Mouth (minor)",
      "description": "Unable to keep secrets and constantly gives away private information",
      "note": "Selected",
      "major": false
    },
    {
      "name": "Impulsive (major)",
      "description": "The hero leaps before he looks",
      "note": "Selected",
      "major": true
    }
  ],
  "abilities": [],
  "armor": [
    {
      "name": "Kevlar Riding Jacket",
      "weight": 8,
      "quantity": 1,
      "armor": 2,
      "coversFace": false,
      "coversHead": false,
      "coversTorso": true,
      "coversLegs": false,
      "coversArms": true,
      "equipped": false,
      "cost": 350,
      "costBuy": 0,
      "minStr": "d4"
    },
    {
      "name": "Kevlar Riding Jeans",
      "weight": 4,
      "quantity": 1,
      "armor": 2,
      "coversFace": false,
      "coversHead": false,
      "coversTorso": false,
      "coversLegs": true,
      "coversArms": false,
      "equipped": false,
      "cost": 175,
      "costBuy": 0,
      "minStr": "d4"
    },
    {
      "name": "Kevlar helmet",
      "weight": 5,
      "quantity": 1,
      "armor": 4,
      "coversFace": false,
      "coversHead": true,
      "coversTorso": false,
      "coversLegs": false,
      "coversArms": false,
      "equipped": false,
      "cost": 80,
      "costBuy": 0,
      "minStr": "d4"
    }
  ],
  "gear": [
    {
      "name": "\"Bug\" (Micro Transmitter)",
      "weight": 0,
      "quantity": 1,
      "contains": [],
      "notes": "",
      "equipped": false,
      "cost": 30,
      "costBuy": 0
    },
    {
      "name": "Bullet, Medium ",
      "weight": 0.04,
      "quantity": 60,
      "contains": [],
      "notes": "",
      "equipped": false,
      "cost": 0.4,
      "costBuy": 0
    },
    {
      "name": "Clothing, Casual",
      "weight": 2,
      "quantity": 1,
      "contains": [],
      "notes": "",
      "equipped": false,
      "cost": 20,
      "costBuy": 0
    },
    {
      "name": "Hand held computer",
      "weight": 1,
      "quantity": 1,
      "contains": [],
      "notes": "",
      "equipped": false,
      "cost": 250,
      "costBuy": 0
    }
  ],
  "weapons": [
    {
      "name": "Unarmed",
      "weight": 0,
      "range": "Melee",
      "damage": "Str",
      "rof": 0,
      "shots": 0,
      "ap": 0,
      "notes": "Innate Attack",
      "thrown": false,
      "quantity": 1,
      "reach": 0,
      "innate": true,
      "damageDiceBase": "1d6+1d12--1d4",
      "damageDiceBasePlus": 4,
      "equipped": false,
      "cost": 0,
      "costBuy": 0,
      "minStr": ""
    },
    {
      "name": "AK47 (7.62mm)",
      "weight": 10,
      "range": "24/48/96",
      "damage": "2d8+1",
      "rof": 3,
      "shots": 30,
      "ap": 2,
      "notes": "",
      "thrown": false,
      "quantity": 1,
      "reach": 0,
      "innate": false,
      "damageDiceBase": "1d6+1d12--1d4",
      "damageDiceBasePlus": 4,
      "equipped": false,
      "cost": 450,
      "costBuy": 0,
      "minStr": "d6"
    },
    {
      "name": "Molecular Knife",
      "weight": 0.5,
      "range": "Melee",
      "damage": "Str+d4+2",
      "rof": 0,
      "shots": 0,
      "ap": 2,
      "notes": " Cannot be thrown",
      "thrown": false,
      "quantity": 1,
      "reach": 0,
      "innate": false,
      "damageDiceBase": "1d6+1d12--1d4",
      "damageDiceBasePlus": 4,
      "equipped": false,
      "cost": 250,
      "costBuy": 0,
      "minStr": "d4"
    },
    {
      "name": "Smith & Wesson (.357)",
      "weight": 5,
      "range": "12/24/48",
      "damage": "2d6+1",
      "rof": 1,
      "shots": 6,
      "ap": 1,
      "notes": "",
      "thrown": false,
      "quantity": 1,
      "reach": 0,
      "innate": false,
      "damageDiceBase": "1d6+1d12--1d4",
      "damageDiceBasePlus": 4,
      "equipped": false,
      "cost": 250,
      "costBuy": 0,
      "minStr": "d4"
    }
  ],
  "cyberware": [
    {
      "name": "Vehicle Control Rig",
      "ranks": 1,
      "quantity": 1,
      "notes": "Rigger experiences a vehicle as their body via neural cutout.",
      "strain": 1,
      "cost": 10000,
      "costBuy": 0
    },
    {
      "name": "Cyberjack",
      "ranks": 1,
      "quantity": 1,
      "notes": "",
      "strain": 1,
      "cost": 3000,
      "costBuy": 0
    },
    {
      "name": "SmartGun Link",
      "ranks": 1,
      "quantity": 1,
      "notes": "Aids Aiming and provides HUD with gun info like ammo, temp, etc",
      "strain": 1,
      "cost": 2000,
      "costBuy": 0
    }
  ],
  "useCharisma": false,
  "charisma": 0,
  "xp": 0,
  "usesXP": false,
  "advancesCount": 0,
  "advances": [],
  "abs": [],
  "languages": [
    {
      "name": "Language(Native)",
      "attribute": "smarts",
      "value": "d8",
      "dieValue": 8,
      "mod": 0
    }
  ],
  "loadLimit": 40,
  "loadLimitBase": 40,
  "load": 37.9,
  "loadLimitModifier": 0,
  "wealth": 500,
  "journal": []
}