{
  "uuid": "91d06a80-a477-11ea-9ee0-5ff88fcf290d",
  "swade": false,
  "wildcard": 1,
  "savagedUsShareURL": "https://savaged.usswade/dragon",
  "imageToken": "",
  "benniesMax": 0,
  "bennies": 0,
  "journal": [],
  "fatigueMax": 1,
  "fatigue": 1,
  "woundsMax": 1,
  "wounds": 1,
  "languages": [],
  "gender": "",
  "heavyArmor": false,
  "size": 8,
  "name": "Dragon",
  "race": "Dragon",
  "rank": 0,
  "rankName": "Bestiary",
  "image": "https://orig00.deviantart.net/8eeb/f/2012/152/f/0/red_dragon__by_amisgaudi-d51yfws.jpg",
  "description": "",
  "background": "",
  "attributes": [
    {
      "name": "agility",
      "value": "d8",
      "dieValue": 8,
      "mod": 0
    },
    {
      "name": "smarts",
      "value": "d8",
      "dieValue": 8,
      "mod": 0
    },
    {
      "name": "spirit",
      "value": "d10",
      "dieValue": 10,
      "mod": 0
    },
    {
      "name": "strength",
      "value": "d12+8",
      "dieValue": 20,
      "mod": 0
    },
    {
      "name": "vigor",
      "value": "d12",
      "dieValue": 12,
      "mod": 0
    }
  ],
  "toughnessBase": 8,
  "toughnessTotal": 20,
  "toughnessTotalNoArmor": 16,
  "toughnessMod": 8,
  "armorValue": 4,
  "parryBase": 0,
  "parryTotal": 0,
  "parryMod": 0,
  "paceBase": 6,
  "paceTotal": 8,
  "paceMod": 2,
  "runningDie": "d6",
  "sanity": 0,
  "skills": [
    {
      "name": "Athletics",
      "value": "d10",
      "dieValue": 10,
      "attribute": "",
      "mod": 0
    },
    {
      "name": "Common Knowledge",
      "value": "d6",
      "dieValue": 6,
      "attribute": "",
      "mod": 0
    },
    {
      "name": "Fighting",
      "value": "d10",
      "dieValue": 10,
      "attribute": "",
      "mod": 0
    },
    {
      "name": "Intimidation",
      "value": "d12",
      "dieValue": 12,
      "attribute": "",
      "mod": 0
    },
    {
      "name": "Notice",
      "value": "d12",
      "dieValue": 12,
      "attribute": "",
      "mod": 0
    },
    {
      "name": "Persuasion",
      "value": "d10",
      "dieValue": 10,
      "attribute": "",
      "mod": 0
    },
    {
      "name": "Stealth",
      "value": "d8",
      "dieValue": 8,
      "attribute": "",
      "mod": 0
    }
  ],
  "edges": [],
  "hindrances": [],
  "abilities": [
    {
      "name": "Armor +4",
      "note": "Scaly hide.",
      "positive": true,
      "description": "Scaly hide.",
      "from": ""
    },
    {
      "name": "Fear (−2)",
      "note": "Anyone who sees a mighty dragon must make a Fear check at −2.",
      "positive": true,
      "description": "Anyone who sees a mighty dragon must make a Fear check at −2.",
      "from": ""
    },
    {
      "name": "Fiery Breath",
      "note": "Dragons breathe fire for 3d6 damage (see Breath Weapons, page 175).",
      "positive": true,
      "description": "Dragons breathe fire for 3d6 damage (see Breath Weapons, page 175).",
      "from": ""
    },
    {
      "name": "Flight",
      "note": "Dragons have a Flying Pace of 24′′.",
      "positive": true,
      "description": "Dragons have a Flying Pace of 24′′.",
      "from": ""
    },
    {
      "name": "Hardy",
      "note": "The creature does not suffer a Wound from being Shaken twice.",
      "positive": true,
      "description": "The creature does not suffer a Wound from being Shaken twice.",
      "from": ""
    },
    {
      "name": "Size 8 (Huge)",
      "note": "Dragons are massive creatures, over 40′ long from nose to tail and weighing over 30,000 pounds.",
      "positive": true,
      "description": "Dragons are massive creatures, over 40′ long from nose to tail and weighing over 30,000 pounds.",
      "from": ""
    },
    {
      "name": "Swat",
      "note": "Dragons ignore up to 4 points of Scale penalties when attacking with their claws.",
      "positive": true,
      "description": "Dragons ignore up to 4 points of Scale penalties when attacking with their claws.",
      "from": ""
    }
  ],
  "armor": [],
  "gear": [
    {
      "name": "",
      "weight": 0,
      "quantity": 1,
      "contains": [],
      "notes": "",
      "equipped": true,
      "cost": 0,
      "costBuy": 0
    }
  ],
  "weapons": [
    {
      "name": "Bite/Claws",
      "notes": "",
      "ap": 0,
      "rof": 0,
      "weight": 0,
      "shots": 0,
      "damage": "Str+d8",
      "range": "Melee",
      "thrown": false,
      "quantity": 1,
      "reach": 0,
      "innate": true,
      "damageDiceBase": "1d6+1d12--1d4",
      "damageDiceBasePlus": 4,
      "equipped": true,
      "cost": 0,
      "costBuy": 0,
      "minStr": ""
    },
    {
      "name": "Tail Lash",
      "notes": " The creature may make a free attack against up to two foes to its side or rear at no penalty",
      "ap": 0,
      "rof": 0,
      "weight": 0,
      "shots": 0,
      "damage": "Str+d4",
      "range": "Melee",
      "thrown": false,
      "quantity": 1,
      "reach": 0,
      "innate": true,
      "damageDiceBase": "1d6+1d12--1d4",
      "damageDiceBasePlus": 4,
      "equipped": true,
      "cost": 0,
      "costBuy": 0,
      "minStr": ""
    }
  ],
  "useCharisma": true,
  "charisma": 0,
  "xp": 0,
  "usesXP": false,
  "advancesCount": 0,
  "advances": [],
  "abs": [],
  "loadLimit": 0,
  "loadLimitBase": 0,
  "load": 0,
  "loadLimitModifier": 0,
  "wealth": 0
}