{
  "projectName": "SourceAFIS",
  "version": "3.1",
  "frontend": "javascript",
  "javascript": {
    "framework": "ionic",
    "config": {
      "SourceDir": "src",
      "DistributionDir": "www",
      "BuildCommand": "npm run-script build",
      "StartCommand": "ionic serve"
    }
  },
  "providers": [
    "awscloudformation"
  ]
}