{
  "body": "{\n  \"probe\": \"data:image/png;base64,iVBORw0KGgoAAAANSUhEUgAAAgAAAAEsCAIAAAA6nJx9AAAAAXNSR0IArs4c6QAAAANzQklUBQYFMwuNgAAAIABJREFUeJzsvX9sJNl9J/b1Xa\",\n  \"candidate\": \"data:image/png;base64,iVBORw0KGgoAAAANSUhEUgAAAgAAAAEsCAIAAAA6nJx9AAAAAXNSR0IArs4c6QAAAANzQklUBQYFMwuNgAAAIABJREFUeJzsvX9sJNl9J/b1Xa\"\n}\n"
}
