{
  "name": "OpenCV",
  "version": "4.5.3",
  "summary": "OpenCV (Computer Vision) for iOS.",
  "homepage": "http://opencv.org",
  "description": "## OpenCV: Open Source Computer Vision Library\n### Resources\n* Homepage: <https://opencv.org>\n* Docs: <https://docs.opencv.org/master/>\n* Q&A forum: <http://answers.opencv.org>\n* Issue tracking: <https://github.com/opencv/opencv/issues>\n### Contributing\nPlease read the [contribution guidelines](https://github.com/opencv/opencv/wiki/How_to_contribute) before starting work on a pull request.\n#### Summary of the guidelines:\n* One pull request per issue;\n* Choose the right base branch;\n* Include tests and documentation;\n* Clean up \"oops\" commits before submitting;\n* Follow the [coding style guide](https://github.com/opencv/opencv/wiki/Coding_Style_Guide).",
  "license": {
    "type": "3-clause BSD",
    "text": "                       By downloading, copying, installing or using the software you agree to this license.\n                       If you do not agree to this license, do not download, install,\n                       copy or use the software.\n                                                 License Agreement\n                                     For Open Source Computer Vision Library\n                                             (3-clause BSD License)\n                       Copyright (C) 2000-2020, Intel Corporation, all rights reserved.\n                       Copyright (C) 2009-2011, Willow Garage Inc., all rights reserved.\n                       Copyright (C) 2009-2016, NVIDIA Corporation, all rights reserved.\n                       Copyright (C) 2010-2013, Advanced Micro Devices, Inc., all rights reserved.\n                       Copyright (C) 2015-2016, OpenCV Foundation, all rights reserved.\n                       Copyright (C) 2015-2016, Itseez Inc., all rights reserved.\n                       Copyright (C) 2019-2020, Xperience AI, all rights reserved.\n                       Third party copyrights are property of their respective owners.\n                       Redistribution and use in source and binary forms, with or without modification,\n                       are permitted provided that the following conditions are met:\n                         * Redistributions of source code must retain the above copyright notice,\n                           this list of conditions and the following disclaimer.\n                         * Redistributions in binary form must reproduce the above copyright notice,\n                           this list of conditions and the following disclaimer in the documentation\n                           and/or other materials provided with the distribution.\n                         * Neither the names of the copyright holders nor the names of the contributors\n                           may be used to endorse or promote products derived from this software\n                           without specific prior written permission.\n                       This software is provided by the copyright holders and contributors \"as is\" and\n                       any express or implied warranties, including, but not limited to, the implied\n                       warranties of merchantability and fitness for a particular purpose are disclaimed.\n                       In no event shall copyright holders or contributors be liable for any direct,\n                       indirect, incidental, special, exemplary, or consequential damages\n                       (including, but not limited to, procurement of substitute goods or services;\n                       loss of use, data, or profits; or business interruption) however caused\n                       and on any theory of liability, whether in contract, strict liability,\n                       or tort (including negligence or otherwise) arising in any way out of\n                       the use of this software, even if advised of the possibility of such damage.\n"
  },
  "authors": "https://github.com/opencv/opencv/graphs/contributors",
  "documentation_url": "https://docs.opencv.org/master/",
  "source": {
    "http": "https://github.com/opencv/opencv/releases/download/4.5.3/opencv-4.5.3-ios-framework.zip",
    "sha256": "b85c23953e66f202a5e4b83484f90556ad4ea9df6fcb7934044d5d4decf2898f"
  },
  "platforms": {
    "ios": "9.0"
  },
  "preserve_paths": "opencv2.framework",
  "source_files": "opencv2.framework/Versions/A/Headers/**/*{.h,.hpp}",
  "public_header_files": "opencv2.framework/Versions/A/Headers/**/*{.h,.hpp}",
  "vendored_frameworks": "opencv2.framework",
  "header_dir": "opencv2",
  "header_mappings_dir": "opencv2.framework/Versions/A/Headers/",
  "libraries": "stdc++",
  "frameworks": [
    "Accelerate",
    "AssetsLibrary",
    "AVFoundation",
    "CoreGraphics",
    "CoreImage",
    "CoreMedia",
    "CoreVideo",
    "Foundation",
    "QuartzCore",
    "UIKit"
  ],
  "requires_arc": false,
  "pod_target_xcconfig": {
    "EXCLUDED_ARCHS[sdk=iphonesimulator*]": "arm64",
    "LIBRARY_SEARCH_PATHS": "$(inherited) $(SDKROOT)/usr/lib/swift $(TOOLCHAIN_DIR)/usr/lib/swift/$(PLATFORM_NAME) $(TOOLCHAIN_DIR)/usr/lib/swift-5.0/$(PLATFORM_NAME)"
  },
  "user_target_xcconfig": {
    "EXCLUDED_ARCHS[sdk=iphonesimulator*]": "arm64",
    "LIBRARY_SEARCH_PATHS": "$(inherited) $(SDKROOT)/usr/lib/swift $(TOOLCHAIN_DIR)/usr/lib/swift/$(PLATFORM_NAME) $(TOOLCHAIN_DIR)/usr/lib/swift-5.0/$(PLATFORM_NAME)"
  }
}
