{
	"name": "Search Logger",
	"version": "3.0.0",
	"author": [
		"Alexia E. Smith",
		"Hydra Wiki Platform Team",
		"Telepedia Ltd"
	],
	"url": "https://gitlab.com/telepedia/extensions/SearchLogger",
	"descriptionmsg": "searchlogger_description",
	"license-name": "GPL-3.0-only",
	"type": "specialpage",
	"requires": {
		"MediaWiki": ">= 1.39.6",
		"extensions": {
			"TelepediaMagic": ">= 1.2.0"
		}
	},
	"AvailableRights": [
		"search_log"
	],
	"GroupPermissions": {
		"sysop": {
			"search_log": true
		}
	},
	"SpecialPages": {
		"SearchLog": "SpecialSearchLog"
	},
	"MessagesDirs": {
		"SearchLogger": [
			"i18n"
		]
	},
	"ExtensionMessagesFiles": {
		"SearchLoggerAliases": "SearchLogger.alias.php"
	},
	"AutoloadClasses": {
		"SearchLoggerHooks": "SearchLogger.hooks.php",
		"SpecialSearchLog": "specials/SpecialSearchLog.php",
		"TemplateSearchLog": "templates/TemplateSearchLog.php"
	},
	"ResourceModules": {
		"ext.searchLogger.styles": {
			"styles": [
				"css/searchlogger.css",
				"css/pagination.css"
			]
		},
		"ext.searchLogger.scripts": {
			"scripts": [
				"js/searchlogger.js"
			],
			"dependencies": [
				"mediawiki.widgets.DateInputWidget"
			]
		}
	},
	"ResourceFileModulePaths": {
		"localBasePath": "",
		"remoteExtPath": "SearchLogger"
	},
	"Hooks": {
		"LoadExtensionSchemaUpdates": "SearchLoggerHooks::onLoadExtensionSchemaUpdates",
		"SpecialSearchResultsPrepend": "SearchLoggerHooks::onSpecialSearchResultsPrepend"
	},
	"manifest_version": 1
}
