{
"revolutemate" : "headtest/onshape/relbowswing",

"posPID.setpoint.min" : -2,
"posPID.setpoint.value" : 0.0,
"posPID.setpoint.max" : 2,

"posPID.kP.min" : 0.0,
"posPID.kP.value" : 0.01,
"posPID.kP.max" : 0.03,

"posPID.kD.min" : 0.0,
"posPID.kD.value" : 0.001,
"posPID.kD.max" : 0.003


}