{
    "name": "Ecology",
    "language": "en",
    "feeds": [
        {
            "name": "The Applied Ecologist",
            "url": "https://appliedecologistsblog.com/rss"
        },
        {
            "name": "Journal of Ecology | The blog",
            "url": "https://jecologyblog.com/rss"
        },
        {
            "name": "Green Tech Media",
            "url": "http://feeds.greentechmedia.com/GreentechMedia"
        }
    ]
}
