{
    "version": "https://jsonfeed.org/version/1",
    "title": "Portal Tutorial",
    "description": "",
    "home_page_url": "https://teknomid.online",
    "feed_url": "https://teknomid.online/feed.json",
    "user_comment": "",
    "author": {
        "name": "Teknomid"
    },
    "items": [
    ]
}
