{
    "inputEmail": "#email",
    "inputPassword": "#loginPassword",
    "btnConnectMe": ".btn--primary > span",
    "btnLinkedin": ".tek-login-linkedin > .btn--secondary",
    "btnGoogle": ".tek-login-google > .btn--secondary",
    "btnRegisterHere": ".loginHeader__createAccount > a",
    "cbRememberMe": "#rememberMe",
    "btnForgotPassword": ".loginHeader__forgotPassword",
    "frameLinkedin": ".login__form",
    "inputEmailLinkedin": "#username",
    "inputPasswordLinkedin": "#password",
    "btnSignInLinkedin": ".btn__primary--large",
    "btnPermitirInLinkedin": "#oauth__auth-form__submit-btn"
}