323557 644890
438312 817927
31888 141302
852913 539636
473744 27920
855762 148052
406803 829420
318762 395176
789635 265726
580725 671543
861786 885952
80284 87872
456229 516478
804225 376648
201776 885051
310479 199266
484774 88353
881470 946584
599883 495103
264044 649113
914246 455021
385096 843541
302627 240167
547536 446050
17952 648403
456846 796528
580696 108524
775868 749208
167293 386341
92011 628898
62707 796008
5188 625794
841024 246601
236385 313552
444362 822940
771053 599262
262548 195765
554756 666880
653724 308234
694698 642357
842051 991555
811199 240974
176838 912223
995099 51507
483509 105193
797842 199751
357091 123786
35873 708272
681242 813175
687999 152897
127921 971997
806183 137995
874742 245964
793651 790931
758610 547255
858287 385810
569318 91204
360981 282071
530183 610111
52242 862712
485077 145235
475678 188778
502884 712266
115124 136250
925408 129333
140574 342320
619876 902984
854418 26620
168011 151342
375125 475539
444189 844575
628 938399
76756 709743
468177 217836
63979 611812
165853 317543
943006 14378
300762 230435
454324 224429
799508 237535
226963 756571
878940 199356
727265 490634
101117 764996
846764 967588
862993 554155
676813 928964
91474 406413
581854 596974
476909 513034
76149 589573
245063 819760
207089 438665
810966 741118
335652 813044
286101 602684
850648 514518
990673 307744
639610 599951
792312 200247
282821 574338
461680 307199
663106 215255
163543 555183
305176 803499
88961 169544
838986 774262
768364 118984
591629 418796
504731 861993
899827 321489
367525 317268
770739 395284
221762 679564
400536 484063
3063 32669
121363 336504
524884 586590
958377 147740
900493 676450
839071 530884
171752 917936
710167 485198
992228 92715
422705 6141
94961 923468
492318 128762
363391 959268
647770 95679
905574 759830
587916 505343
828161 26743
553974 211702
171303 832458
818277 921475
797309 524557
563309 361709
409525 713337
320710 896543
960046 915887
404308 552374
450512 677789
132013 530344
924157 8844
403091 750516
940944 273460
378125 551287
647007 505299
842999 964399
786881 630143
60582 543671
574922 674951
354225 121056
656283 239175
598457 653809
371435 226071
110138 735153
229353 447162
344880 481716
385780 527080
560051 682736
73103 641900
54208 681633
575427 50622
749405 906824
797562 952471
715065 942451
427236 387415
508922 766139
945689 617466
233317 796700
630595 503928
727604 571770
35800 714653
573748 959283
758755 466986
79139 735055
515123 436581
210918 227633
322615 239740
552075 424200
876328 209312
969355 80240
669899 584014
388024 382584
898798 193428
538960 60044
807283 314247
876556 441028
394150 839871
109673 23149
4751 439607
247305 638975
263533 399919
87679 574098
100069 33628
857127 105326
482781 498969
558720 594662
763258 336838
291779 744970
412411 146124
877365 829275
516758 36486
327734 225777
864228 945384
129242 512338
826792 961597
630740 190737
701692 558036
459273 982652
904018 411677
7007 637561
657245 256106
168357 474555
943206 590435
523319 568367
292587 647718
366082 927891
361676 478902
162187 479981
804636 844397
362791 929006
638500 651491
832946 933575
768947 448190
864197 861665
471623 127332
670955 429851
61228 575333
976425 200208
842886 57817
135037 875944
87527 77393
2828 499133
332248 971314
603075 972622
540026 322161
648078 773789
642342 603311
269280 699046
247232 400187
