254378 782416
143569 920841
365824 638971
507932 176245
689124 402137
975318 824567
312459 591823
865421 139758
428731 713594
264910 973182
753249 185620
629847 506319
917284 342568
198345 876542
654987 328419
518267 769432
437619 942713
381945 621834
289176 835741
674823 193284
926718 478126
573816 841927
412896 759243
839416 125794
147925 695283
295871 531468
718425 362841
367198 954328
821734 238467
639782 714829
547318 876521
486215 629473
164972 943816
738241 518926
295847 782431
925183 176342
693827 412589
259783 864291
847213 531942
329481 917624
628914 295473
367421 749318
481926 358247
218746 694281
753198 926347
586327 147925
392478 835216
134569 572913
749216 421387
482631 869341
365124 721834
918742 462357
649831 287415
573692 831426
423176 594283
265839 739824
874512 326198
198427 675932
836192 214879
517649 983216
326514 749128
924681 538297
492376 817435
718492 642385
583742 397821
367824 851429
138547 726491
948723 315278
659234 817649
281634 932476
724158 648372
539821 172468
613294 857341
472836 319784
794682 586421
249863 913274
861239 475823
527381 948127
478216 394827
936124 782451
214839 651287
682734 527913
318247 394186
759421 238746
428613 976342
361249 592748
597382 846231
185327 713294
827314 469231
247981 865732
739216 316824
682347 578924
428795 931246
216347 697824
864219 354891
538127 719286
294816 865731
641782 473896
518364 928347
287341 659278
749218 328746
635249 781462
892134 415267
472831 634598
316248 897432
795428 342176
654982 618273
248713 479326
972468 136984
826473 597184
581749 213467
349786 825714
718623 456789
964287 231476
295834 872641
631478 518924
476295 369824
783462 924178
347682 651284
219748 986317
839216 217864
574138 932617
361942 485739
928741 576394
427619 983146
369814 748256
281974 649327
714236 385192
563891 972643
927364 416295
648257 392814
317492 865214
485927 724369
139572 862734
572431 394618
934716 527148
486125 319874
724981 638527
169842 783452
538972 246813
874325 561398
312498 695827
652749 983216
318267 527946
964738 819427
782615 436198
519827 673124
427813 598736
385649 247196
972613 834591
739124 512486
681495 924736
295386 746821
826149 537981
469327 318472
781249 924367
592148 673219
347692 185374
895127 742613
213469 946138
764198 538274
426978 317842
219384 648752
935627 472819
748126 581739
582974 365218
327415 692834
815394 427869
467382 925318
836274 519847
682439 174926
197465 538724
821643 349786
478965 619243
634219 842573
895321 746182
312874 694281
946382 158723
572496 827431
859124 734216
247865 431978
318724 697845
461982 582347
739218 924756
516347 375982
284579 961324
924375 815496
372816 548197
691248 437826
857391 924167
436798 725184
218463 589742
794681 372549
682741 915428
519827 346791
247518 963274
978216 452837
685123 219874
743289 581724
512947 396874
967842 524381
794382 618275
437589 295816
918372 536742
374829 895261
652471 428917
139742 784216
527961 361894
895624 247319
316894 742518
784239 695172
428971 315249
695817 138724
217849 364982
538274 926417
361749 792418
924738 571682
476182 319874
782946 598471
315279 683124
694182 247918
927148 538726
538417 274819
865217 419782
427681 795218
693417 218754
819726 347192
247318 582914
572391 936178
319487 726148
794231 618427
216879 947326
583271 724189
471826 398417
724318 915782
318467 746192
695748 472138
827914 216349
491278 683215
218374 596731
657198 324789
986347 218576
381649 954182
572491 317468
924731 786215
218473 593621
815924 436891
347869 782419
692784 319487
538721 865924
461782 219734
924817 374928