856121 742095 525
616417 497033 470
67508 789431 509
469664 189941 449
433278 47368 449
879935 33131 525
388434 670977 509
634270 722933 504
768471 257764 509
940972 891351 507
847223 8615 525
675718 343613 509
708491 287606 509
622736 871817 525
714610 691359 504
852925 921854 476
412419 720703 509
753067 87716 509
328986 505491 449
997995 710280 525
714488 506833 509
768000 104423 509
794987 789908 437
981861 919607 507
600644 862100 525
448596 447680 369
478649 178722 449
465785 186644 449
324346 42708 443
817733 650940 504
796668 279949 509
370521 525203 470
159998 795623 509
883786 397858 525
683525 349827 509
109988 351082 443
900980 613604 525
103625 688581 509
634964 943733 525
1369 582584 470
379379 360391 423
48579 256533 443
979885 898690 507
663301 311555 509
574270 611129 434
648203 649880 385
554825 727650 509
459662 425456 400
302492 861610 525
72324 394447 443
101940 996542 525
905200 440801 525
924435 362429 525
42644 55471 340
801764 659853 504
868577 417390 525
599272 248022 470
933932 646880 525
538667 131957 470
459067 747093 509
790002 168419 509
863779 548980 525
682671 556597 509
528583 623676 452
792231 94539 509
689763 154245 509
325162 917323 525
689988 649988 442
176250 833004 509
276266 49903 443
319964 862240 525
773438 871528 525
488493 347118 449
409351 280031 441
546878 437589 470
158525 157528 339
244642 792771 509
695752 131360 509
196081 337494 443
726940 527502 509
225338 352451 443
140367 488868 449
957664 423516 525
862712 34193 525
208280 211832 355
733633 980425 525
882642 453515 525
636793 487072 509
736809 146557 509
794928 383484 509
208471 69254 383
223366 36983 386
858442 267069 525
994180 81341 525
720660 998251 525
505786 597584 470
457025 65732 449
697060 902623 525
469548 270088 449
833119 354857 509
243503 253810 350
651076 151550 509
256731 684614 509
3903 236010 443
490743 120031 449
70758 684631 509
924348 802396 525
489887 503822 426
440308 655852 509
276525 489157 449
852778 739548 525
154029 104769 375
503949 357870 449
74672 944826 525
285443 806655 509
733560 962257 525
675524 110331 509
260156 627016 509
237247 837456 509
364649 107013 443
172024 370586 443
446050 773180 509
862289 134102 525
981245 267385 525
994149 517622 525
377427 622197 470
972690 296054 525
333602 644662 509
952773 489019 525
442086 68676 449
786973 135692 509
111526 817910 509
208271 564916 470
719881 90593 509
858301 232324 525
850789 535936 525
737147 798036 468
821062 936967 525
969254 236453 525
748897 772717 468
864497 667863 525
800399 598103 509
523506 544830 408
72552 266965 443
976415 185990 525
66910 818381 509
840990 87455 525
209967 323915 443
846736 138548 525
884456 931895 476
721663 872649 525
242938 856852 525
770188 969797 525
95600 472893 449
238577 630802 509
150296 248853 443
992491 676614 525
934462 373975 525
667279 986431 525
256448 714723 509
115294 718829 509
864900 326359 525
546786 972702 525
232767 775547 509
908992 985084 507
49184 886885 525
487460 89200 449
533258 51295 470
518806 259338 470
467028 134169 449
395106 879001 525
141819 598883 470
434572 119224 449
876128 535040 525
49246 107081 354
855694 897893 445
143244 798796 509
156757 422635 449
123779 875989 525
131622 117235 344
108833 554211 470
82639 802588 509
829744 737172 468
258404 368464 441
234357 834520 509
259632 245468 363
857817 569962 525
559133 340425 470
576305 242612 470
400868 293641 441
709285 59893 509
715832 918417 525
734214 42406 509
858621 305184 525
854599 280642 525
455936 152443 449
756011 754664 362
313790 704306 509
359649 998665 525
377619 454717 449
521349 432256 470
628594 360820 509
324352 207258 443
742586 742893 318
97616 621086 470
708581 322381 509
56489 248402 443
225430 50773 386
413834 905713 525
278926 767261 509
28171 573590 470
664775 624841 509
817188 345981 509
408083 348688 436
562702 764809 509
608141 934577 525
906958 919945 476
415904 97133 449
149158 890566 525
174397 351416 443
187002 271342 443
236184 864429 525
182102 934174 525
37303 118979 354
416623 513698 470
47413 48378 283
982597 352771 525
833576 691472 504
875553 841140 432
311649 247286 407
727365 321770 509
702501 209721 509
978485 899676 507
935310 34980 525
739393 761769 424
344155 871247 525
386192 20038 443
216978 66659 386
658313 810189 504
864423 424841 525
145270 933360 525
827778 883147 525
851463 616447 525
759307 806599 468
238688 742253 509
916490 442043 525
279174 275688 389
723628 146601 509
789602 148162 509
125320 843909 525
150730 66507 375
270957 321874 389
196477 797030 509
357922 144045 443
896123 817201 525
519484 574574 452
553790 113995 470
768471 985396 525
215871 890312 525
144966 55790 375
149196 300655 443
728282 791751 468
333038 336228 366
482492 566660 470
834861 777896 468
947260 154987 525
481002 601046 470
483698 682432 509
464966 162240 449
931213 378073 525
822039 804573 450
504277 64134 449
995292 354370 525
149521 220550 386
709184 66135 509
83001 484517 449
934034 341234 525
192524 214395 373
827619 992037 525
61665 514754 470
916255 34507 525
294769 662893 509
28757 506813 449
398030 855825 525
100772 18007 351
782014 289389 509
39237 692425 509
