518 369
320 827
562 680
358 939
263 507
278 27
55 271
102 237
670 191
229 299
470 766
813 109
862 319
310 163
462 481
65 668
757 247
442 245
33 843
559 541
288 292
683 324
65 870
825 202
606 124
816 36
447 740
994 373
833 726
745 208
438 190
915 47
844 771
572 668
377 326
834 478
335 209
717 936
882 719
570 78
560 178
464 879
907 799
861 943
670 189
723 880
545 448
253 626
394 402
430 751
863 727
593 148
420 174
5 964
84 506
401 767
308 291
759 583
798 529
424 259
459 136
806 328
695 830
522 901
675 897
55 139
384 961
166 62
629 181
53 519
12 162
872 325
244 606
786 652
885 75
175 651
231 505
120 48
282 155
646 628
133 968
69 668
773 715
646 318
297 86
541 752
19 393
287 409
304 328
505 73
384 154
417 398
64 52
516 606
389 916
452 447
998 669
883 663
185 931
136 585
497 106
287 576
611 834
698 300
937 566
626 842
747 597
72 182
419 284
113 181
303 333
584 728
865 788
148 81
611 44
338 430
663 635
136 963
955 676
557 329
68 922
302 520
191 965
803 709
534 458
862 357
797 225
641 473
129 389
187 803
520 155
281 157
432 831
544 563
865 71
681 74
528 461
768 223
394 772
814 450
517 655
957 125
717 719
425 312
90 206
496 970
468 558
572 95
435 868
261 523
376 274
793 420
45 913
145 876
208 493
602 713
317 640
912 420
135 412
683 674
67 626
635 711
377 618
764 336
459 223
389 883
72 995
26 25
906 974
336 188
730 277
380 181
790 938
615 450
572 43
480 937
736 586
591 301
536 926
41 21
379 679
347 520
345 42
312 779
305 860
719 595
183 830
823 84
803 79
969 335
570 922
436 858
538 742
823 732
420 289
595 311
301 94
466 46
404 922
231 155
393 132
533 570
338 483
114 797
254 163
620 208
762 857
26 797
254 523
28 436
535 152
987 562
463 7
81 210
955 505
222 143
456 497
723 472
333 448
2 439
292 345
390 588
573 535
660 265
344 998
385 323
238 517
899 495
609 663
462 299
747 159
169 237
195 138
282 318
743 725
540 362
390 647
51 831
64 620
251 46
760 978
423 415
333 167
484 429
141 686
480 164
938 985
21 701
