856121 742095
616417 497033
67508 789431
469664 189941
433278 47368
879935 33131
388434 670977
634270 722933
768471 257764
940972 891351
847223 8615
675718 343613
708491 287606
622736 871817
714610 691359
852925 921854
412419 720703
753067 87716
328986 505491
997995 710280
714488 506833
768000 104423
794987 789908
981861 919607
600644 862100
448596 447680
478649 178722
465785 186644
324346 42708
817733 650940
796668 279949
370521 525203
159998 795623
883786 397858
683525 349827
109988 351082
900980 613604
103625 688581
634964 943733
1369 582584
379379 360391
48579 256533
979885 898690
663301 311555
574270 611129
648203 649880
554825 727650
459662 425456
302492 861610
72324 394447
101940 996542
905200 440801
924435 362429
42644 55471
801764 659853
868577 417390
599272 248022
933932 646880
538667 131957
459067 747093
790002 168419
863779 548980
682671 556597
528583 623676
792231 94539
689763 154245
325162 917323
689988 649988
176250 833004
276266 49903
319964 862240
773438 871528
488493 347118
409351 280031
546878 437589
158525 157528
244642 792771
695752 131360
196081 337494
726940 527502
225338 352451
140367 488868
957664 423516
862712 34193
208280 211832
733633 980425
882642 453515
636793 487072
736809 146557
794928 383484
208471 69254
223366 36983
858442 267069
994180 81341
720660 998251
505786 597584
457025 65732
697060 902623
469548 270088
833119 354857
243503 253810
651076 151550
256731 684614
3903 236010
490743 120031
70758 684631
924348 802396
489887 503822
440308 655852
276525 489157
852778 739548
154029 104769
503949 357870
74672 944826
285443 806655
733560 962257
675524 110331
260156 627016
237247 837456
364649 107013
172024 370586
446050 773180
862289 134102
981245 267385
994149 517622
377427 622197
972690 296054
333602 644662
952773 489019
442086 68676
786973 135692
111526 817910
208271 564916
719881 90593
858301 232324
850789 535936
737147 798036
821062 936967
969254 236453
748897 772717
864497 667863
800399 598103
523506 544830
72552 266965
976415 185990
66910 818381
840990 87455
209967 323915
846736 138548
884456 931895
721663 872649
242938 856852
770188 969797
95600 472893
238577 630802
150296 248853
992491 676614
934462 373975
667279 986431
256448 714723
115294 718829
864900 326359
546786 972702
232767 775547
908992 985084
49184 886885
487460 89200
533258 51295
518806 259338
467028 134169
395106 879001
141819 598883
434572 119224
876128 535040
49246 107081
855694 897893
143244 798796
156757 422635
123779 875989
131622 117235
108833 554211
82639 802588
829744 737172
258404 368464
234357 834520
259632 245468
857817 569962
559133 340425
576305 242612
400868 293641
709285 59893
715832 918417
734214 42406
858621 305184
854599 280642
455936 152443
756011 754664
313790 704306
359649 998665
377619 454717
521349 432256
628594 360820
324352 207258
742586 742893
97616 621086
708581 322381
56489 248402
225430 50773
413834 905713
278926 767261
28171 573590
664775 624841
817188 345981
408083 348688
562702 764809
608141 934577
906958 919945
415904 97133
149158 890566
174397 351416
187002 271342
236184 864429
182102 934174
37303 118979
416623 513698
47413 48378
982597 352771
833576 691472
875553 841140
311649 247286
727365 321770
702501 209721
978485 899676
935310 34980
739393 761769
344155 871247
386192 20038
216978 66659
658313 810189
864423 424841
145270 933360
827778 883147
851463 616447
759307 806599
238688 742253
916490 442043
279174 275688
723628 146601
789602 148162
125320 843909
150730 66507
270957 321874
196477 797030
357922 144045
896123 817201
519484 574574
553790 113995
768471 985396
215871 890312
144966 55790
149196 300655
728282 791751
333038 336228
482492 566660
834861 777896
947260 154987
481002 601046
483698 682432
464966 162240
931213 378073
822039 804573
504277 64134
995292 354370
149521 220550
709184 66135
83001 484517
934034 341234
192524 214395
827619 992037
61665 514754
916255 34507
294769 662893
28757 506813
398030 855825
100772 18007
782014 289389
39237 692425
