702899 97883
489815 187730
93478 345233
142797 211054
842415 339396
30572 961503
298179 50953
140582 990964
898058 498865
237710 76575
879798 489949
794750 262903
516814 911904
573976 189810
671906 113536
850724 757321
340962 920684
37555 605268
974046 964896
691234 221613
638179 424714
733597 583872
830094 138300
21926 421090
637106 436297
962341 625591
338839 771753
121235 496356
637703 944817
211669 878810
527341 600454
169767 41656
231125 102458
392304 404043
599760 886278
244496 499894
251661 913483
461643 799620
678082 977389
263950 747836
704363 750698
862135 510583
284423 922817
25192 785271
327871 308546
56831 197448
25559 967458
942655 603766
497370 765039
490782 507316
508286 86001
262622 706294
679984 56039
572688 665888
915031 776147
568595 825879
601614 642386
757948 358802
738798 697482
666816 964431
577043 705649
584737 883016
689992 321218
529211 558247
255310 102957
112199 483531
283978 141553
250337 585697
379552 611371
53661 672450
977500 804021
251033 602439
675914 375002
78324 30653
642702 541666
907120 14793
627090 654058
560665 669435
175304 122679
327051 854566
161498 917034
4789 343576
653053 260144
567439 140763
774986 28690
233086 951647
920258 542804
638579 21499
590563 278266
389164 576613
525700 142999
365755 381322
69214 436444
686148 131926
313623 271351
711741 925577
153265 229921
851656 543051
668212 610827
645447 325850
797983 960528
386804 690248
272154 536004
448863 185792
929786 151162
285934 274164
482404 816168
733011 833950
254032 164415
623433 112440
392908 512285
293573 750339
927010 422461
561878 79515
581404 682242
451477 108692
759030 235356
722797 982924
527363 417274
200522 884421
177938 37956
220812 492779
783530 452506
544509 64293
103832 260689
38491 872300
250503 317835
534379 745212
232725 944222
175505 997589
886921 3352
661298 673754
615955 739264
623227 186660
477962 928158
958042 983435
20835 179644
113933 323178
101038 687014
162060 680222
747326 636568
956202 759182
561609 591853
794832 313131
604948 821742
871381 144580
680190 252065
125797 428503
700983 312794
986177 64677
730563 638542
846578 225757
63292 848664
684665 388829
766063 878714
726613 485575
482040 200972
913933 624533
8866 150424
709998 640753
316802 532862
821488 150471
515811 571840
78155 40993
463416 634791
499762 501486
422501 939886
809119 753343
194233 477704
689897 751848
812585 753268
629669 785658
671494 660988
453526 719875
967559 922444
298976 584324
492512 273612
432962 46534
74411 920282
89704 58010
115294 292613
932561 858446
691129 985146
140626 461925
370205 396333
117865 324260
197624 503552
40094 88009
678934 524148
22211 482937
656383 670383
819113 990113
195882 271613
92175 210105
866541 768734
596365 672836
500248 747251
618665 560674
864521 179899
455490 725556
602257 294665
240310 19505
966938 396773
831295 612009
533638 304725
446853 366586
657728 292460
403311 475830
817825 146907
904210 866283
805484 518225
624175 903284
266415 658377
607932 854438
898054 913170
617362 147358
865006 380541
97319 766440
868484 893433
926428 104767
40859 539033
95741 733435
980106 347157
38341 801989
643145 496569
388958 178025
898095 854845
673057 334782
394310 218661
652054 399890
249852 36213
152123 345096
281604 107748
86663 363476
830511 789376
611607 214138
440831 768554
552813 610659
692138 754691
286578 923591
591065 101818
502736 857764
451253 161605
296259 400852
920788 804880
185707 608598
66264 740825
916997 303343
