2045 3039 217
5708 8730 262
7774 8978 252
1390 3515 217
6921 8911 257
6642 9746 260
2983 5653 238
6023 7077 262
1666 8075 262
6388 7691 257
7467 9562 260
2376 6038 238
4088 5268 215
4585 8076 262
3561 6894 262
3218 5041 238
4877 5005 210
4375 7427 262
7317 8977 252
5202 5691 236
2898 8245 262
2475 4944 238
3585 8369 262
4673 4908 197
7907 8702 252
6063 6966 262
5241 7861 262
4198 9433 262
3262 5377 238
1233 4523 238
5370 6228 262
1848 6357 262
6938 9673 260
4221 5397 215
3123 5237 238
1442 5748 238
4118 6648 262
1260 3440 217
5574 5761 205
1836 6485 262
7567 9652 260
6119 7306 262
4023 7886 262
3932 4863 215
4386 6917 262
3417 5928 238
1356 3950 238
4356 5693 236
3565 7916 262
3685 8215 262
5231 9062 262
6526 7257 257
1708 6065 238
4930 6195 262
3587 9975 262
1123 8899 262
4992 9255 262
3100 8778 262
3931 5910 236
6466 8477 257
6919 8623 257
2999 5918 238
6197 9833 260
4336 8770 262
2332 4057 238
2295 7111 262
6944 8100 252
2563 9419 262
4318 8464 262
5143 5707 236
4363 6056 236
7159 9720 260
1387 3549 217
4107 5691 236
3331 8301 262
6866 9425 260
3580 4564 238
5275 5818 236
4130 4503 215
6429 9960 260
4655 9631 262
7858 8069 252
3671 6892 262
3424 5145 238
5065 6447 262
5588 8660 262
5696 8806 262
6262 7128 257
1051 5209 238
1531 3488 217
1257 8611 262
7795 8283 252
1530 1659 167
6897 7697 257
2210 6647 262
3695 5658 238
4384 8349 262
7083 9372 260
5602 8795 262
2570 8327 262
4559 9906 262
1185 3090 217
6585 9091 257
4617 5323 210
4613 7319 262
3878 7757 262
1504 7350 262
6572 7129 257
2037 8341 262
3539 4930 238
7444 8458 252
6912 7032 257
6031 7790 262
2710 8649 262
2012 4893 238
3507 9432 262
5852 7194 262
6136 6805 262
7607 8247 252
1643 4799 238
5298 6897 262
7431 7726 208
5311 6533 262
5361 5671 236
2831 7118 262
1720 2087 180
5540 8800 262
6384 8367 257
3808 6411 262
4668 5696 236
2962 4995 238
1974 9458 262
4998 5314 192
6738 9670 260
5174 9635 262
6707 8223 257
1024 7731 262
2524 6451 262
7751 9191 252
1413 6595 262
7261 9263 260
5832 8727 262
4378 8671 262
7387 7599 239
1533 7431 262
5090 6486 262
5710 6564 262
3944 7680 262
4474 9128 262
1360 4763 238
6881 9004 257
2985 4585 238
4667 8309 262
5072 7294 262
3166 9328 262
5576 8245 262
7597 9956 260
7483 8466 252
7488 9040 252
6017 6677 262
2074 4641 238
1109 5950 238
4855 7412 262
6205 6260 187
5966 9541 262
1863 4128 238
7786 7945 190
2019 9680 262
3742 7347 262
2842 8877 262
2568 9147 262
4002 5835 236
5538 8168 262
3385 8990 262
4316 8728 262
5934 9463 262
6621 7132 257
5570 8170 262
5908 6016 187
1784 8976 262
2385 9081 262
5821 6529 262
4321 6831 262
1545 3785 238
2701 3615 217
2186 9129 262
1988 5332 238
5227 5409 192
4176 4359 202
7277 7336 195
6156 7363 262
2511 7333 262
2423 9847 262
7657 8857 252
1793 4741 238
4822 7579 262
5426 9293 262
6946 7872 239
3050 6212 262
7472 8282 252
1678 9761 262
6822 7512 257
5597 8549 262
1980 3368 217
1716 7781 262
2530 9883 262
1999 4408 238
3675 9873 262
6650 9883 260
3725 7256 262
7969 9481 260
4957 7987 262
1437 4487 238
7829 9699 260
1514 9468 262
2613 5169 238
7299 8670 252
5757 7371 262
4942 6383 262
5250 6380 262
3194 9600 262
6266 6687 244
4796 7927 262
7746 9126 252
6015 9695 262
6852 8644 257
7480 8042 252
7625 7772 177
2422 9762 262
1149 6405 262
5532 9633 262
3392 4216 238
7728 8664 252
4626 9889 262
6191 8913 257
1068 4020 238
7759 9841 260
6983 7485 239
6890 9893 260
1918 5768 238
4980 5395 192
6692 9739 260
7019 9089 252
4670 8703 262
1363 5878 238
6390 7042 257
3368 5088 238
4857 7660 262
5215 5548 205
3111 7666 262
