123 1175
2100 1340
2571 63
2755 2155
2821 1683
501 755
72 2621
1841 978
48 1697
1967 1915
2768 157
775 2725
554 2426
163 1687
119 892
442 2796
234 2604
1220 1368
2028 1356
2050 2627
365 2201
2485 1391
2160 1784
535 557
2498 2498
71 916
303 468
1329 1277
2703 1887
2326 130
1602 2609
2174 298
442 911
1175 300
8 858
1283 314
185 653
1272 1078
2760 413
576 351
75 2907
699 1618
1343 2962
218 2069
184 1573
2142 1337
707 1709
389 1669
1423 1142
229 688
2043 2166
45 2188
695 2697
2442 264
1881 968
2106 653
2750 747
1567 1124
2445 261
204 1574
638 530
2945 2515
1102 1899
1882 53
357 137
1775 1158
445 121
997 2352
1520 2455
1709 2739
1542 1632
1536 297
1326 1183
2229 914
1472 804
1009 2967
573 1282
186 542
1443 1458
7 1955
37 2116
1126 2985
933 990
1353 1624
831 695
31 926
2799 898
73 2498
2439 1278
559 1383
1430 181
372 1367
446 711
115 2365
1599 2313
2939 2926
829 2804
287 773
1209 2877
229 1498
2437 313
1248 631
2387 1498
776 2586
1483 2608
2129 594
2602 405
2169 784
806 719
2534 595
2070 1405
1885 2542
1466 2922
669 269
2543 492
1739 1037
792 1172
1702 2790
207 899
2943 73
829 1195
2228 1014
1570 338
1376 2928
2510 498
2923 1672
2281 903
878 132
2089 2731
375 2793
457 810
1592 1233
349 653
1312 1240
268 2921
1391 2704
19 291
1013 1232
1262 1623
1922 2826
2454 2580
436 1073
1345 1389
1594 1580
2453 318
955 2348
1051 1585
2037 2265
2801 2497
354 396
213 2320
2505 1350
67 2740
660 597
2261 819
810 2725
1515 870
2484 227
1955 665
2042 1278
1002 1402
1489 128
2104 2928
2998 333
2133 602
2254 372
467 2109
740 1433
2885 1432
2471 2659
2512 1065
2986 1057
1055 142
2940 2966
1544 814
2607 1814
1816 1919
2508 1595
861 2130
2164 2595
2627 645
1771 1168
2486 2732
1546 609
2314 888
2447 1275
2017 873
269 1689
306 434
1858 826
221 213
1763 1154
698 1153
1368 78
2375 2947
977 2579
1437 2002
2955 1898
526 550
185 255
30 1261
592 2547
1484 341
1764 410
2349 2264
2485 2246
1598 111
740 2742
2725 2388
703 852
598 1633
2088 2835
2994 1907
1063 1954
793 1113
424 1999
2682 1898
1112 1617
1644 2393
2088 2611
2199 265
2989 636
292 2407
1796 1919
1422 1656
2018 1785
12 37
2178 2580
2842 941
579 1412
72 1754
2916 1320
610 656
31 2000
2894 730
1926 2823
497 2705
2960 670
2693 2274
512 92
2986 2172
2593 1940
683 2808
2123 1377
2318 2056
1285 429
1235 1858
526 2125
304 573
2250 2133
2107 745
332 2855
365 1506
887 901
962 208
2647 1631
2391 2965
88 153
2187 2563
1324 699
1172 1038
2652 1825
1565 504
2871 2453
2529 2547
83 2034
479 2662
259 2184
2576 1809
688 365
2015 676
245 2614
147 869
2019 1619
281 2204
2881 2926
285 2225
2106 556
2008 2194
573 1735
947 1430
1561 2949
255 365
2277 2899
2951 891
2279 1890
281 386
1008 915
2206 1072
1933 692
2106 764
674 2638
1015 2551
1623 954
964 1792
2670 2006
2270 652
350 2920
934 1079
538 1345
