1 1
893879 893879
980617 742240
367331 246201
818012 682600
195623 619257
156718 702271
290991 152692
270048 400974
243540 526282
428390 120318
142543 402217
380967 82123
740573 247674
845214 382556
145139 624080
259920 648847
747642 738255
609209 42371
747317 718441
847331 953090
997420 334114
811062 596691
34175 778129
815537 766646
247070 804078
814504 283558
454865 396437
581895 958553
330063 362009
322776 72398
150218 89525
103828 544337
939028 832742
607111 982842
675996 488891
295344 223631
806485 40239
284837 292852
143003 84482
691713 4907
218222 402156
769189 847022
855628 700179
806432 572353
450416 35283
286404 610149
317892 899848
314168 257658
953645 595387
689749 376667
484247 821956
65182 373338
270694 987813
772177 757781
374203 801878
764917 325876
446222 116433
10307 973253
281269 945813
612005 827281
505436 457862
167129 408775
871668 657215
983844 942692
746583 7229
11753 237109
19897 472558
528958 14717
303349 630123
474385 611590
163107 75240
585411 699228
356599 245243
162196 903485
58013 593758
319729 120693
717563 581438
555123 419155
427792 385544
782440 754791
300238 417719
219075 197596
76649 554155
499168 282915
841128 788617
938939 49615
152563 631659
350663 29279
424766 939931
270954 655842
888082 42226
107909 3639
393828 816857
666599 423619
443393 572939
644594 687890
494865 515611
336715 984641
420507 511165
603581 825193
125009 388006
288126 310989
9543 229929
346685 890185
697366 919712
598170 139060
966395 179468
647852 906360
558882 568713
523246 373184
78944 443226
110307 447774
524686 37992
929906 669175
546719 781278
433103 656864
479662 316104
553462 249727
649186 991012
324392 73612
96 400880
783456 792
837245 970568
583177 615161
120989 59732
2030 4254
117155 815906
685313 141451
907412 548830
307493 379151
15587 287016
802686 31497
360024 710004
307524 873982
141032 890014
792559 729855
416638 590508
607699 978533
873264 740613
852021 425741
28650 265156
67624 163029
659493 129728
952776 186595
899481 659684
186986 824070
135320 393706
179713 977618
401712 615123
855117 646861
509674 499573
871120 677724
396446 600991
762591 249153
471245 467274
363915 942810
646079 59452
586305 38502
251238 103712
548955 205116
424645 925764
889769 324881
655858 219643
707218 640277
976996 724684
679099 377755
132936 880049
801525 79844
467438 720589
21863 781920
581427 609115
620205 21878
589205 492955
828118 58949
662837 370645
161330 127622
531270 572444
980010 676818
285525 524683
416360 715040
844655 30539
537407 553175
981862 429138
893716 574886
577386 32683
405259 97883
956300 763426
239520 70143
999654 497640
882570 146381
895853 844301
216994 802214
790386 507010
15029 75351
38449 226201
513115 420118
10324 118937
234404 595129
590713 980310
580954 942153
521042 921344
816531 328320
198307 275605
743356 696288
781226 328181
240709 676335
760691 226263
238868 829583
691293 66787
601331 210337
124865 752971
544543 541809
589252 577579
677861 598638
252587 894562
187734 445441
710663 340628
235250 537300
78618 293049
394386 8730
327740 232546
407692 484846
290607 242112
189043 48922
874816 873110
186472 366570
711726 776584
595440 693173
596790 263275
466346 191501
509025 566592
623607 157575
737578 825660
513430 555762
825242 309850
548742 281098
732761 949765
975854 571538
778328 832586
596563 950496
942414 938730
516972 780664
843399 357427
113965 593723
814771 570299
368780 329893
220924 817216
282471 296805
49434 592599
399652 438041
339020 443070
586430 671276
335257 991488
462205 474158
361684 737192
648947 555254
129687 438069
996770 944168
565337 978439
78863 937404
492011 354744
428104 613836
705932 231883
891949 957788
751757 469394
307493 489595
53468 364260
28014 456351
547868 819178
886556 196497
480515 917687
489519 29145
617753 321215
72119 676597
173221 769227
469899 678952
287466 533518
117137 122422
907135 914197
571557 288622
784231 280197
926431 291769
163053 429224
289615 499641
498571 643553
241262 802411
272363 438636
398637 194778
827654 447629
546333 188233
14618 511434
670011 544744
446774 136338
220054 919326
393323 757798
22234 882422
103359 35005
306980 759073
788872 745413
