986895 259101
452467 210152
395663 27743
814684 108519
795982 658775
38413 399282
541391 685928
133336 396410
473558 315957
167420 622452
142359 60606
190499 228712
589103 856355
166648 726232
886669 912191
315833 51050
904284 745178
784987 766829
308546 669081
933794 129460
975357 974685
394283 208125
410851 112821
112989 226525
508873 662203
964738 22977
212486 298198
632047 565621
641748 373940
460211 679603
79784 260756
831759 843289
466642 728664
436427 973147
225225 901153
439969 68530
952165 211592
898256 323381
220155 845142
646402 473523
715429 993734
660916 831584
445602 725573
334617 263324
470507 388483
817866 663890
576520 588133
284055 371057
128503 196579
210412 260381
361952 362735
516956 152389
394613 151143
796923 691720
299404 470307
719727 44156
106920 160679
496744 338266
675617 584584
103980 451070
956686 903698
404147 300503
156424 779005
465375 387932
844712 633087
217389 765051
341161 679045
912389 297697
685291 592637
356669 277365
140202 183860
913251 588371
19043 318896
281690 952426
59133 316973
570200 824561
303191 976059
129365 729067
844403 571252
381662 768710
617622 301633
661559 473731
699462 962016
798397 884886
158909 660736
851766 847908
246519 13839
967733 992411
480608 31532
282585 476588
598901 537788
86622 918483
558448 747847
248218 153578
559916 515817
853141 790665
634177 388102
101035 367386
278799 559007
829940 497719
941348 52153
186678 4569
864754 219104
374966 588021
271638 819201
551644 351137
639888 439292
759801 147503
222681 539764
366661 812299
533711 147609
391571 352147
181431 810459
883373 725763
673854 935312
610691 77978
623813 674244
535989 49503
766083 79861
648872 448189
704292 316380
69334 463853
103249 471184
214018 981509
45006 28577
378893 759284
320119 384986
322645 3948
434206 829857
959640 216004
476961 122319
257527 685974
733367 33902
316933 166388
706405 525528
301749 991610
532776 729436
226629 157362
749517 123170
990566 454801
756768 849790
70992 881419
81304 284331
114937 120033
539593 186603
837609 977189
679555 530924
654472 100311
499302 310469
54558 952012
946739 589570
600997 985369
430496 991416
774109 458486
691449 11307
670011 842213
471292 121959
863949 327463
194327 888414
737431 601589
279742 447587
916673 153496
70178 199824
208705 655136
875183 121194
111428 968115
547251 271155
249071 300250
904117 561576
272094 792916
926200 830663
554358 12498
346625 510085
222835 804807
523953 328123
739608 15796
607993 597798
199692 378668
916331 805304
614527 570203
574700 400011
699026 104765
790577 625248
998625 155237
321468 237803
216468 441171
237586 760231
919581 326903
699453 715823
502733 745300
579190 638877
513647 29518
784029 656828
205516 56785
986266 893496
59316 309450
15344 196473
37275 211576
333862 480243
348991 721272
