232 354
9 364
148 378
229 251
208 279
277 308
195 196
292 319
337 378
364 398
263 282
165 247
357 398
35 177
83 364
351 376
342 364
9 89
75 296
245 256
99 283
372 400
54 187
205 212
287 287
197 284
130 202
79 349
394 396
38 82
211 387
268 291
127 272
383 386
307 355
100 326
234 377
366 376
390 396
319 336
284 369
269 334
274 292
364 382
255 360
61 218
110 300
1 70
219 239
342 356
254 288
288 329
359 392
231 272
262 393
380 380
98 144
43 99
51 98
102 203
336 360
276 310
153 347
100 362
375 377
21 21
18 386
74 186
236 279
183 288
161 315
377 377
202 281
142 213
310 369
125 139
30 273
84 121
186 354
308 308
273 324
263 378
108 195
366 385
237 267
308 329
361 385
298 325
76 246
375 397
178 185
48 187
27 368
276 300
375 394
129 314
240 245
322 371
99 172
44 304
123 126
217 351
387 392
71 372
10 279
385 395
339 382
295 363
278 341
162 271
324 363
134 169
267 278
335 372
354 360
159 371
97 352
54 322
327 343
91 384
211 341
395 396
64 87
51 102
310 372
230 250
239 332
131 233
322 343
57 212
18 97
5 25
354 394
220 290
241 381
64 219
319 379
358 389
154 230
170 210
235 274
33 125
122 153
352 357
181 239
26 104
239 242
151 271
138 139
216 270
191 295
81 352
225 261
193 366
113 126
307 345
342 370
56 144
262 386
141 204
271 375
26 394
198 260
93 159
292 335
375 393
25 199
235 273
116 376
205 206
352 398
44 55
341 400
233 369
223 223
372 396
387 399
293 377
90 218
270 310
125 316
163 214
377 378
203 274
60 259
395 397
148 231
309 380
7 169
53 166
93 349
135 145
156 348
47 186
221 373
273 288
375 383
63 394
195 196
327 360
135 230
268 395
387 390
339 379
310 322
100 160
197 271
74 328
389 394
195 197
27 381
234 304
44 191
363 370
141 323
58 340
209 356
284 399
35 216
225 339
310 338
141 185
116 218
27 146
56 362
342 400
342 348
103 146
156 204
238 364
272 290
151 169
340 378
53 332
120 304
206 394
94 294
80 222
374 396
159 249
339 378
229 388
158 274
179 236
140 183
257 328
119 391
392 397
35 239
165 271
355 397
138 298
14 350
187 263
299 347
237 275
116 286
331 378
223 360
194 264
395 396
133 146
110 337
265 349
257 330
357 371
328 391
262 312
246 279
313 381
224 246
156 162
317 357
397 398
8 334
291 311
266 314
8 13
351 360
22 132
277 393
386 389
13 86
285 299
114 383
201 332
150 346
235 374
301 337
3 115
117 335
275 349
208 362
67 363
278 312
194 284
344 384
166 399
294 306
392 392
