847 863
565 738
203 982
984 398
683 980
484 838
994 823
247 822
830 87
701 568
46 322
498 395
334 390
434 326
251 967
415 812
311 18
164 159
604 171
573 450
898 833
307 624
149 844
816 568
191 455
799 77
80 184
289 512
877 306
862 776
662 313
793 284
905 698
70 155
669 664
541 563
46 387
470 104
519 354
186 592
657 879
353 753
585 248
693 675
153 558
499 183
366 133
83 463
811 761
250 817
863 987
567 886
194 883
696 327
676 543
472 559
554 368
251 305
64 792
200 193
541 429
824 502
384 322
838 539
883 421
571 262
804 463
718 101
412 460
652 778
667 924
64 457
628 947
168 151
822 445
794 262
331 513
675 663
455 24
816 473
351 61
626 947
413 34
778 646
570 634
52 896
906 679
606 357
305 668
432 499
84 470
652 502
6 182
889 551
803 539
31 323
917 140
740 191
424 945
463 557
611 272
499 26
367 409
51 244
100 325
900 106
484 275
782 253
903 857
289 847
150 914
90 649
828 731
967 682
290 849
658 198
480 877
60 850
121 403
750 239
694 377
658 126
252 756
752 31
563 951
721 407
982 467
450 32
414 923
329 386
220 189
877 628
887 841
985 979
13 735
991 959
231 773
768 928
354 666
80 107
531 122
370 683
290 185
264 661
351 389
919 117
739 282
33 592
572 423
162 907
577 363
160 386
756 336
409 371
433 98
388 976
669 162
122 420
844 638
845 276
21 553
850 853
699 284
381 327
681 406
698 635
253 884
779 390
802 436
291 504
672 53
605 717
687 177
703 453
663 642
593 772
45 104
975 194
401 247
942 966
671 531
660 834
77 969
91 611
179 667
684 998
960 783
950 885
104 887
763 459
515 603
250 460
747 354
453 856
811 62
930 286
417 782
885 783
755 837
997 866
609 526
977 778
175 23
745 241
229 814
463 419
470 170
790 708
59 207
1000 84
81 880
717 527
55 278
306 411
113 341
852 826
647 153
78 716
339 233
139 144
322 99
296 879
573 905
736 485
244 983
377 719
924 785
994 708
955 328
46 910
345 151
391 388
794 431
151 906
270 126
612 809
749 386
352 595
148 788
875 146
749 956
994 572
628 912
705 801
628 724
406 807
580 152
640 917
955 540
450 724
