128580 563864
819594 384272
554954 101913
12835 434041
833819 507880
538393 48346
72391 812016
601041 203754
120533 470428
132616 46316
401306 945712
188500 618511
87430 36908
367138 448554
706742 529046
933426 547837
485390 401976
214432 858215
209141 440720
191157 756959
198805 310207
933935 623175
640247 360238
817303 989874
78487 20959
962730 464109
185176 985855
469083 87282
30218 982057
452692 777408
467741 403411
877866 16370
281054 151867
500721 155944
600648 303695
680605 391858
733721 883833
595551 459149
157964 506243
172442 443759
112163 652746
868169 125603
487901 219437
301869 872510
482754 765290
29535 9769
881867 450307
1334 397238
687181 859712
648390 917981
802031 863899
906605 115577
433280 168547
282069 103138
595549 749592
894666 120664
986432 234169
344995 438051
801798 607356
209215 588760
270340 542939
243931 447243
267321 609034
22870 363123
704779 703412
758403 72438
528534 55353
168621 656042
286655 352766
649786 592651
387088 975576
708705 537639
586716 414753
838965 836321
310833 472787
232394 818901
164268 748333
123251 602196
84437 321023
535554 388960
691050 671523
296887 6627
211004 78648
542966 970778
13179 267751
391195 780159
578381 672834
53199 482365
726349 566055
393895 83555
529404 634728
394783 987253
231469 588558
243521 529636
312854 279164
518383 274080
553845 362972
777736 10664
575772 940498
38566 771780
702698 294877
907902 540130
342264 169361
770865 668393
199999 441315
255768 768005
247116 135206
993350 596598
593704 558701
623742 247096
488838 484233
340042 209929
46221 765162
574223 434999
377380 506830
416313 232542
558258 23575
437818 754387
549136 856857
609744 936175
639001 508535
672844 260153
751825 451384
490946 19189
879064 227407
987155 215885
192291 931043
92432 899663
716417 858478
106061 830974
849963 808123
248353 981595
935317 767589
252697 983573
331261 687628
706999 527304
23973 325892
299331 99362
418061 796064
689581 538737
977426 690576
190767 553476
133331 455445
210630 491547
421667 396159
180971 724550
352342 52776
464334 303381
477712 240412
25569 843919
118608 561456
735028 91456
222711 902063
42265 545069
604935 181761
476258 912156
868619 123528
660551 12835
797093 706987
879260 305434
754570 973156
584395 733779
468970 939757
952680 205935
146634 839018
555467 678244
383856 301940
85712 442890
793177 999785
543958 759217
810165 147057
345749 748498
421489 758368
749410 646835
264110 25439
254346 166088
954779 290628
242658 878842
376485 206165
647992 507120
684840 347445
126751 403711
774001 559313
719532 92121
265232 756152
901881 517325
618155 885571
433176 364479
712580 563419
80726 412620
686850 671197
329026 7617
922116 290358
305094 127199
844392 188229
517676 500547
600288 839738
840487 483755
226636 559554
198019 355151
462138 986106
598065 256163
779029 781818
572679 716752
737642 188562
57162 615839
990830 12355
781046 148373
400121 612208
616280 71496
347371 177475
686276 314356
106659 926847
202015 716972
807414 936653
524873 733135
653194 284394
662144 7739
794685 757329
919542 523720
547364 317827
116457 687996
360110 622811
119307 683362
146391 557804
853759 320598
925731 38751
305764 787959
75748 302987
815787 150699
306564 539166
737819 735869
734 529148
584664 847969
404501 932559
364424 653526
150084 549605
227541 741165
475324 618115
850986 888181
763385 376222
179860 439464
809125 910384
872615 362816
581216 779229
686564 432301
576656 570240
901716 909867
249391 146582
133597 187664
358702 247915
