799375 597004
750104 627349
393531 763417
470588 489285
381203 629292
509638 884936
625635 814778
68243 738680
714557 966892
184834 477082
204421 752040
244463 739513
44175 162495
715398 421533
640261 755949
320353 323651
233332 546365
392228 901469
294362 870315
484241 405712
524137 67793
311394 90126
827254 791713
481978 639834
716636 310068
735530 531029
417191 401375
707109 107878
782550 601287
98823 341377
347327 159936
667076 504704
875299 277535
525121 512770
410032 865095
155307 601117
698448 464169
387487 995939
547615 888817
263825 513468
506108 243649
63507 721387
10192 909622
236862 245380
73915 918684
21615 670909
642212 904897
530047 156176
392356 140208
530787 337032
781183 587952
353067 89316
491023 177149
332966 719353
887913 114478
542244 64820
79491 412292
104095 501390
186567 328388
113661 947857
345273 971916
601387 287067
606323 160323
411699 940514
903778 808996
202744 700784
591549 660061
64859 187619
1796 862007
431217 98615
16758 488469
114068 756058
128760 439660
401194 190354
795830 184439
938337 594747
348192 594130
345510 324687
526399 540968
648676 159922
882374 215139
899931 179298
214572 502111
972671 237360
466562 828485
134499 486131
454300 702016
681374 496591
363087 867845
278672 779014
847963 139923
382108 975186
860759 740136
479169 630329
59334 866145
27933 892965
936456 864892
887819 187776
670283 781228
756143 755830
92209 337833
525123 781419
349781 903194
219157 590638
377527 788569
308092 553636
591895 637784
232919 695137
357681 197703
862920 676906
491885 189623
410382 556878
509009 754625
419641 751467
343631 355607
847907 159694
474300 184424
692651 264440
917029 910932
664885 346389
876284 84170
216467 253130
4768 895163
272543 93041
423524 254357
215953 173525
906153 61559
46797 86304
330584 971806
325190 640198
597112 651876
646498 874057
216437 217905
780379 844576
963295 416014
969864 456010
506552 426859
574300 315595
297565 18973
71712 394329
932157 554315
875515 499558
323695 822053
729812 933266
638299 891319
833126 556658
572085 712332
346872 669866
164070 526889
221244 76929
62694 837323
631526 887997
220089 149673
470633 439541
408196 233680
159992 969877
86807 726956
65393 407146
10150 109404
767935 142548
986061 792750
508477 786582
624083 490262
169785 384099
454427 350659
501717 244081
880628 737702
560121 134622
195107 467799
781932 119988
521603 626094
939813 814099
83875 579437
570568 362009
776071 805114
832185 763064
268800 566141
162554 529907
822100 684981
912940 534812
40418 207268
727328 465190
607992 34251
40631 902283
885398 501965
782597 980603
748850 956462
747435 406386
756307 369159
465857 569659
440492 491278
180853 92864
439036 532967
772618 926030
431240 388204
245060 790624
39410 391821
602353 618153
558459 208031
706062 48586
148062 653222
289567 833930
320653 138386
273008 508434
202926 886371
188564 242460
276417 341999
926227 52221
334787 266877
776751 248748
872980 511542
934978 389594
515708 76420
766719 101513
491496 795414
592918 205718
922091 492913
817624 987142
739695 398388
589307 146817
286242 616788
332487 410795
393093 651139
528899 337647
539960 133316
591067 192803
338717 706230
950884 212005
923949 866890
874898 821128
648320 814960
478156 226221
197950 25485
3622 166269
452767 421146
877755 791583
174605 707739
53254 649170
804348 237716
649732 668088
724697 893008
307611 175344
857461 827052
683325 17810
248164 515435
230374 37239
78457 987068
