807430 656205 504
45750 874671 525
650563 120152 509
990866 600558 525
157180 51646 383
18977 887805 525
434992 619502 470
464760 848181 525
683899 548094 509
946791 482180 525
543138 678460 509
458338 552471 470
88352 363683 443
501290 496402 395
844957 905821 445
226726 738210 509
576931 774097 509
172465 311582 443
853265 894989 445
886424 580514 525
59676 4041 340
121627 904002 525
27031 663771 509
187053 655510 509
885404 619020 525
400061 384114 436
377132 79442 443
189708 849105 525
722261 689207 504
436580 188050 449
518346 508277 470
871620 475562 525
775064 947479 525
28000 189617 383
525277 260016 470
854671 234794 525
186634 401130 443
482385 537873 470
215204 551913 470
241260 789566 509
447452 574946 470
719645 356709 509
639219 504619 509
490137 82096 449
543049 960395 525
962658 990401 458
732269 890274 525
964043 676665 525
675968 868160 525
596888 535495 452
367565 152719 443
196357 994425 525
594017 55327 470
466698 516435 470
182235 197449 360
708774 269178 509
630272 373692 509
163414 737949 509
218606 378782 443
512114 219807 470
454147 148956 449
970258 347294 525
750242 441923 509
226407 724304 509
450148 347464 449
561556 469620 470
221131 139929 386
261900 54983 443
582970 263150 470
907840 813048 525
20715 317296 443
430855 583104 470
995898 328477 525
534676 576455 452
966049 536930 525
141714 113801 349
553837 309323 470
111226 560979 470
770604 18677 509
296871 359461 441
90532 883157 525
363331 269140 441
603951 292560 470
978109 693074 525
327011 290881 384
166602 198851 365
205744 535931 470
199853 942453 525
418362 699465 509
691549 753694 504
583909 640732 509
411644 337066 449
677739 203018 509
876095 68977 525
883675 944964 507
192978 72625 383
574504 776307 509
155779 187586 383
406364 442250 449
988618 156812 525
990971 360965 525
909010 18916 525
781447 377377 509
983515 677428 525
476564 441349 444
673074 942261 525
622338 82101 470
359791 973020 525
814914 580282 509
825000 285351 509
638986 741318 504
924790 522666 525
670368 767082 504
739284 289815 509
755512 768070 468
70814 440759 449
651608 116383 509
329016 207600 443
687663 757602 504
538265 550455 452
756586 61538 509
844061 439 525
272538 760092 509
811921 169658 509
895342 456191 525
885900 57584 525
624858 971339 525
937301 397111 525
175524 777368 509
615369 243103 470
831668 854589 525
937490 882083 476
653343 382804 509
200009 84081 383
266697 392916 441
582517 669060 509
623357 629400 509
415219 32498 449
635550 492006 509
155968 693995 509
451735 794345 509
24759 553352 470
157946 605851 470
325615 500801 449
294392 25339 443
494562 744364 509
357224 806108 509
363159 796495 509
617629 671819 509
327064 727889 509
527997 433914 470
639549 555366 509
983770 69853 525
701296 511636 509
242703 563555 470
476041 945348 525
120675 252778 443
356915 786055 509
321123 60959 443
692336 282898 509
435937 809435 509
843298 429112 525
382761 705236 509
534747 989215 525
564353 476204 470
414617 821266 509
809722 547218 509
592184 66212 470
994420 499742 525
644215 493271 509
851303 209841 525
978540 418592 525
861427 70905 525
713202 859685 525
642491 975179 525
172369 665153 509
750105 439092 509
967159 597254 525
597012 670210 509
275954 393135 441
132935 17800 354
617321 857013 525
667215 879246 525
458743 622918 470
764804 530675 509
556465 776755 509
936319 750948 525
315752 223114 443
407830 692103 509
363160 770085 509
383194 782012 509
423932 108699 449
404055 472038 449
96599 43884 351
957621 297330 525
792197 309008 509
928194 883871 476
590821 13651 470
270900 889140 525
918860 541178 525
697288 889069 525
633570 791157 504
759808 480676 509
482928 380458 449
68493 752092 509
33719 486815 449
809064 634728 504
297994 155235 443
959409 58230 525
616339 434304 470
391014 617104 470
67396 293007 443
420553 24077 449
48409 969528 525
285054 664819 509
871936 990588 507
130959 175153 383
262851 44626 443
66063 956982 525
60133 313227 443
926301 894744 476
350938 42486 443
802141 77815 509
983016 321001 525
