227 4764
794 4554
525 2140
419 3613
669 2493
639 3713
296 4661
14 1330
918 4466
556 4690
942 3109
162 2507
484 3178
51 2665
103 4037
861 3886
519 697
921 1592
903 281
12 4575
906 3407
986 2760
524 2928
90 2360
459 4700
5 2967
658 326
274 3321
913 2556
282 4579
715 4381
992 4197
462 4956
84 4139
240 3500
375 643
785 3062
962 1733
770 1079
541 2470
740 3592
135 4832
231 4224
775 1841
319 1612
993 1263
261 3993
590 4192
577 2887
548 1853
21 2223
578 4441
646 1534
421 914
197 3394
204 3392
690 673
370 1321
948 4153
507 3887
716 2780
267 4537
122 2019
483 910
47 2165
944 660
799 402
141 2997
437 3515
754 3366
107 4670
111 3831
952 2725
623 2356
848 841
803 3732
932 140
700 1699
66 3082
427 3781
548 3849
717 3336
644 3134
715 2354
341 1805
149 2362
842 1777
222 2280
660 2566
109 3920
562 1315
645 4164
744 3572
547 4252
125 1235
966 1047
840 1216
824 4046
644 1369
813 418
491 3321
80 738
36 981
585 3356
656 2695
27 1006
604 728
282 1282
168 4439
162 2274
853 57
6 1946
227 2257
678 2347
90 524
315 3541
731 398
842 958
183 1708
257 4303
877 3232
857 2408
849 3522
450 4987
99 1551
799 1107
991 4377
559 1019
446 1780
845 4355
145 2670
848 3580
905 4783
249 2113
927 4840
204 3150
420 3745
401 3257
1 740
326 3978
596 3992
752 861
616 616
417 3358
992 1897
795 3041
242 2145
172 209
685 4163
370 3812
191 956
900 1955
82 901
50 2531
627 4106
286 1473
724 3475
341 1908
612 2364
75 705
59 4492
608 2203
422 3638
897 961
131 3421
844 3775
458 4621
901 1977
312 1420
555 861
655 3952
117 4843
341 2797
996 2172
91 4320
212 4645
316 2716
748 4072
478 1553
399 1655
176 1095
475 2075
923 2268
566 2606
916 2217
472 1889
993 1333
971 675
916 4504
957 1323
340 2990
76 4023
629 3442
897 3558
319 2080
874 699
624 3805
356 1005
999 2260
435 1729
765 2213
206 348
52 1719
590 1878
251 2928
323 3822
251 99
670 1991
700 1915
90 12
775 574
25 3135
25 774
912 3755
77 2542
825 138
659 4421
303 4
322 3655
466 970
59 312
808 2813
994 688
74 4150
69 4397
525 169
192 3842
172 4310
374 3741
954 1072
309 1215
884 3001
526 2984
648 3135
652 571
837 4208
156 4501
152 3199
806 3074
742 844
602 2134
545 3824
845 926
625 3483
344 2175
837 3164
639 3248
656 371
60 4175
147 879
