480796 142330
703060 156985
268252 98748
942820 913573
531937 525602
60424 792310
328387 68019
814088 926761
946303 224594
393976 180043
7560 620149
286853 392647
738671 313577
316788 665449
170151 428418
440305 800628
350353 328680
803146 347232
73656 424448
750435 987752
267711 986816
989445 354534
405446 618309
763603 525320
808844 712327
40988 919689
368193 841114
190842 321336
761223 356585
414326 336386
491190 762585
525771 139757
8475 856193
6069 54420
573710 343834
47553 631352
175605 858938
946345 154463
94476 672724
370574 413793
869897 212238
246658 709808
829078 265069
913088 137079
816758 409467
107127 935962
894229 768749
784370 210564
596816 964931
506424 285765
947410 149019
567369 785848
802523 485243
971836 906169
70981 223825
171924 563746
709277 935534
697390 928566
189373 615548
840478 637855
121461 547897
194318 601473
641032 394102
340498 963493
165297 945396
482272 137178
601814 998303
194643 154259
324730 922195
37207 737580
616783 36093
887404 839297
174867 806440
40695 535354
40917 650911
826738 600339
514756 374534
491850 289876
977510 96828
834497 510357
889352 878059
766201 213126
68922 179334
165551 952604
434850 281025
776104 914576
329648 905168
886590 265175
352464 747262
649403 376954
86332 461032
984208 932584
279668 343030
884834 756719
101315 429389
981048 631149
457684 18546
74192 953196
184098 733273
480324 330639
274578 189147
696560 552483
46903 386009
873398 492089
661603 709522
575250 293659
648971 72859
793486 681024
714941 615180
601040 622628
969375 613241
75374 725294
736580 606268
875179 65677
409343 338712
296583 940571
219248 443964
32216 733950
125692 311055
413393 471709
897766 428891
532695 625968
382691 71380
420414 617460
42483 883409
881921 599045
801193 396819
915709 998963
489642 211226
556853 346500
743727 53991
657627 541671
847198 327842
875888 870556
476130 489793
150944 240933
607351 728065
642982 763094
596506 576773
165048 779221
286064 748301
902422 23657
560391 446630
238573 707692
831895 11276
146653 443145
561710 567357
475162 256919
146379 438254
919437 873192
104428 294017
898956 112973
332975 998002
272059 440451
696113 196743
991018 696386
837670 153734
399524 236243
775783 790238
655421 614683
144447 168298
224417 185741
571189 817693
861299 552845
620009 107739
677052 794377
754680 277841
421975 570637
240918 173558
59363 782878
32279 105604
305498 849759
504635 365277
521347 92444
232123 119988
360369 192005
90697 546839
134090 794287
148800 929542
56676 337333
102701 835355
832245 814205
485192 625793
843204 131740
648923 300071
657174 723425
992505 814930
508445 635773
876852 517262
464028 14092
97526 466878
852348 944393
542429 211263
609123 184297
921424 169872
319618 677116
119434 540263
989060 60917
755026 718206
358312 928159
301626 682927
205454 758041
987565 49318
363806 265012
369708 214111
764608 399293
186445 324027
96205 638653
129593 986001
907384 467655
478578 361422
13066 42461
54506 923731
688282 461136
3844 864034
890133 904952
484104 692623
652292 828729
149958 557793
148335 81151
867141 282779
664673 955783
100554 71682
872991 273410
349817 283257
917316 18547
274169 447919
823628 658534
487795 205772
43919 27631
955349 175572
301251 210961
529029 91996
