169005 352685
583895 42615
30696 495061
13298 727491
446642 703370
121552 339264
988362 222028
795445 511980
733800 295005
374177 815434
435456 73882
158910 561775
433423 279563
12464 141362
607638 515234
375553 208022
199806 649722
269713 82619
834994 641835
922758 585469
639256 296417
114700 190809
878439 965205
33494 190368
500929 423181
323798 983406
883881 513167
789954 111232
335986 35448
416308 226734
254313 829549
574295 740621
697059 174210
552842 929455
933558 497621
475791 735765
817174 632109
72139 123633
632321 118719
785200 450976
355006 125071
149971 274807
392663 470607
573292 312190
71436 242357
493157 660248
322180 616889
744928 991832
212015 409751
876368 902514
367449 582474
700576 857662
636920 125797
204128 797978
198425 682982
67487 866063
633295 824442
87363 288586
673129 295192
689212 212602
336140 216486
36349 87908
590703 99539
169606 667450
3037 762990
816637 861781
649305 445466
762641 52154
82636 778570
967437 651048
812911 654210
148110 444127
228937 171008
948907 939340
870523 383847
83801 495521
204403 497476
836501 992682
46246 610948
596419 757430
529094 895208
300599 125302
850986 78716
511744 866823
954381 675664
941744 922656
868801 898513
127029 96168
805351 305361
476736 878415
97573 813958
712666 459893
228679 426011
662615 572206
340859 584117
260445 259646
78908 88531
128572 715910
843071 324318
241663 22977
436783 612038
516673 158471
971908 302763
914266 569264
894905 734879
941536 499623
588445 713767
61057 75965
797335 627710
70807 344445
911686 909394
934212 413658
590097 36697
36904 996798
990535 11080
595369 870516
566493 862987
148792 91886
377002 541313
403666 188039
584426 432369
163351 789337
910790 332157
311973 732448
671620 350259
972437 190844
287594 703428
785195 385544
131505 355434
840893 604577
277876 340738
696062 552477
464206 37141
968304 690567
823576 862179
231339 281329
219402 845722
72827 658160
568303 985957
684688 958633
498434 479252
216598 949059
428412 4964
859380 997054
898929 176175
120068 547204
254894 687275
401065 132775
965240 934045
163752 488337
30284 246997
255847 696452
842696 648635
982551 971884
32896 166787
982919 126764
901648 887468
227011 742126
724278 174182
416422 490292
585851 483572
20077 370415
953220 747032
300183 723665
599701 308375
196743 804729
519635 262092
105921 874591
804491 619619
315347 551172
479018 642273
926436 809159
888813 787092
826524 47779
907522 440178
535910 244580
63675 655005
342762 879973
733280 285678
631988 225746
836287 527632
908843 219382
332553 309875
39635 835333
314310 361283
112806 108698
259058 870807
166317 575706
904166 69548
931364 827749
248827 872806
387950 408577
298606 778142
813760 43575
279722 286598
696003 923603
431397 792688
458880 955643
361770 243002
346703 131614
103952 191329
596888 731145
744376 564700
661057 191103
358631 502625
555011 924894
174420 483792
222310 625650
809364 705202
4061 697098
598807 609069
268534 501705
151543 973118
333044 49238
526762 883599
788168 903761
880008 318298
787130 352695
