123 1175 182
2100 1340 180
2571 63 209
2755 2155 209
2821 1683 209
501 755 171
72 2621 209
1841 978 182
48 1697 182
1967 1915 175
2768 157 209
775 2725 209
554 2426 183
163 1687 182
119 892 179
442 2796 209
234 2604 209
1220 1368 177
2028 1356 180
2050 2627 209
365 2201 182
2485 1391 209
2160 1784 175
535 557 137
2498 2498 178
71 916 179
303 468 144
1329 1277 177
2703 1887 209
2326 130 183
1602 2609 209
2174 298 182
442 911 179
1175 300 182
8 858 171
1283 314 182
185 653 145
1272 1078 182
2760 413 209
576 351 142
75 2907 209
699 1618 182
1343 2962 217
218 2069 182
184 1573 182
2142 1337 180
707 1709 182
389 1669 182
1423 1142 182
229 688 145
2043 2166 170
45 2188 182
695 2697 209
2442 264 183
1881 968 182
2106 653 182
2750 747 209
1567 1124 182
2445 261 183
204 1574 182
638 530 137
2945 2515 217
1102 1899 182
1882 53 182
357 137 144
1775 1158 182
445 121 144
997 2352 183
1520 2455 183
1709 2739 209
1542 1632 167
1536 297 182
1326 1183 177
2229 914 183
1472 804 182
1009 2967 217
573 1282 182
186 542 144
1443 1458 141
7 1955 182
37 2116 182
1126 2985 217
933 990 174
1353 1624 172
831 695 171
31 926 179
2799 898 209
73 2498 209
2439 1278 183
559 1383 182
1430 181 182
372 1367 182
446 711 171
115 2365 183
1599 2313 183
2939 2926 173
829 2804 209
287 773 171
1209 2877 209
229 1498 182
2437 313 183
1248 631 182
2387 1498 183
776 2586 209
1483 2608 209
2129 594 182
2602 405 209
2169 784 182
806 719 153
2534 595 209
2070 1405 180
1885 2542 209
1466 2922 217
669 269 145
2543 492 209
1739 1037 182
792 1172 182
1702 2790 209
207 899 179
2943 73 217
829 1195 182
2228 1014 183
1570 338 182
1376 2928 217
2510 498 209
2923 1672 217
2281 903 183
878 132 179
2089 2731 209
375 2793 209
457 810 171
1592 1233 177
349 653 145
1312 1240 177
268 2921 217
1391 2704 209
19 291 128
1013 1232 182
1262 1623 177
1922 2826 209
2454 2580 209
436 1073 179
1345 1389 159
1594 1580 167
2453 318 183
955 2348 183
1051 1585 182
2037 2265 183
2801 2497 191
354 396 121
213 2320 183
2505 1350 209
67 2740 209
660 597 145
2261 819 183
810 2725 209
1515 870 182
2484 227 209
1955 665 182
2042 1278 180
1002 1402 182
1489 128 182
2104 2928 217
2998 333 217
2133 602 182
2254 372 183
467 2109 182
740 1433 182
2885 1432 209
2471 2659 191
2512 1065 209
2986 1057 217
1055 142 179
2940 2966 173
1544 814 182
2607 1814 209
1816 1919 175
2508 1595 209
861 2130 182
2164 2595 209
2627 645 209
1771 1168 180
2486 2732 191
1546 609 182
2314 888 183
2447 1275 183
2017 873 182
269 1689 182
306 434 144
1858 826 182
221 213 115
1763 1154 182
698 1153 179
1368 78 182
2375 2947 217
977 2579 209
1437 2002 180
2955 1898 217
526 550 137
185 255 128
30 1261 182
592 2547 209
1484 341 182
1764 410 182
2349 2264 183
2485 2246 209
1598 111 182
740 2742 209
2725 2388 209
703 852 171
598 1633 182
2088 2835 209
2994 1907 217
1063 1954 182
793 1113 179
424 1999 182
2682 1898 209
1112 1617 182
1644 2393 183
2088 2611 209
2199 265 182
2989 636 217
292 2407 183
1796 1919 175
1422 1656 172
2018 1785 175
12 37 112
2178 2580 209
2842 941 209
579 1412 182
72 1754 182
2916 1320 209
610 656 145
31 2000 182
2894 730 209
1926 2823 209
497 2705 209
2960 670 217
2693 2274 209
512 92 144
2986 2172 217
2593 1940 209
683 2808 209
2123 1377 180
2318 2056 183
1285 429 182
1235 1858 180
526 2125 182
304 573 144
2250 2133 183
2107 745 182
332 2855 209
365 1506 182
887 901 148
962 208 179
2647 1631 209
2391 2965 217
88 153 122
2187 2563 209
1324 699 182
1172 1038 182
2652 1825 209
1565 504 182
2871 2453 209
2529 2547 178
83 2034 182
479 2662 209
259 2184 182
2576 1809 209
688 365 145
2015 676 182
245 2614 209
147 869 171
2019 1619 180
281 2204 182
2881 2926 217
285 2225 183
2106 556 182
2008 2194 170
573 1735 182
947 1430 182
1561 2949 217
255 365 144
2277 2899 209
2951 891 217
2279 1890 183
281 386 144
1008 915 174
2206 1072 182
1933 692 182
2106 764 182
674 2638 209
1015 2551 209
1623 954 182
964 1792 182
2670 2006 209
2270 652 183
350 2920 217
934 1079 174
538 1345 182
