101785 363385 443
957837 27536 525
575984 291771 470
91601 217366 386
751830 478120 509
264736 28530 443
377443 511644 449
866220 616888 525
523225 91192 470
458082 386958 449
37653 834686 509
582192 617056 447
389723 110943 443
812375 459635 509
678253 339310 509
88261 886661 525
477274 849250 525
955375 984052 458
671991 982785 525
218753 310262 443
27174 703557 509
434803 4000 449
139076 92434 354
606969 171270 470
936175 320376 525
51287 328013 443
175094 782941 509
81372 827438 509
214110 763262 509
524153 120737 470
545687 171237 470
817463 43714 509
152737 323374 443
400067 952302 525
27143 36569 324
998032 768810 525
342610 644694 509
607667 336844 470
508584 195485 449
810969 28176 509
32887 304662 443
735044 135148 509
169902 645784 509
75127 421536 449
324551 300621 384
881863 176329 525
213181 434679 449
780592 721770 468
606687 179530 470
356258 923230 525
96092 854063 525
353489 389225 436
175794 454677 449
970426 535735 525
18396 929797 525
266562 730515 509
751137 933757 525
67961 958098 525
497344 120812 449
118788 543016 470
616312 667833 509
520110 147806 470
576751 763392 509
536732 614571 452
222082 209056 386
451895 204092 449
317274 613831 470
656854 269451 509
8430 214532 383
361502 1468 443
295270 960424 525
569204 216926 470
210226 180762 373
286061 554646 470
186587 288455 443
293829 340440 384
458744 752516 509
760624 469949 509
282157 774505 509
268357 114988 443
169299 747748 509
996622 830788 525
824801 59675 509
717342 135921 509
708101 172381 509
629897 655117 416
954860 941718 414
947845 9021 525
525637 797620 509
188287 939755 525
379968 394869 436
933905 338606 525
536726 797919 509
572652 382344 470
665492 358951 509
452119 116981 449
911662 166119 525
627630 881897 525
1607 125488 354
834823 23503 509
166471 116944 383
419421 209541 449
735505 609274 509
809685 642873 504
161950 298538 443
871117 775556 525
377880 546492 470
389716 257850 441
452457 357686 449
788137 770460 437
99176 274124 443
397786 654633 509
128111 946970 525
275396 982368 525
357471 530932 470
789411 34644 509
79803 397090 443
480138 43898 449
280950 406712 441
726538 97361 509
645395 563410 509
588175 220181 470
594736 31600 470
88157 506703 449
421304 157052 449
612892 233404 470
762850 166609 509
91423 815849 509
456353 862606 525
912216 631100 525
488045 732296 509
157177 985498 525
82994 569354 470
102884 994791 525
35064 860405 525
255205 588776 470
623769 713903 509
780377 452622 509
314240 556637 470
518094 459938 470
640485 804230 504
275259 309521 389
397462 811901 509
860979 965448 507
524093 626392 509
788513 489174 509
430829 358729 449
873423 121273 525
133023 530814 470
742578 924025 525
155738 745491 509
552389 917047 525
387702 468220 449
388382 447518 449
234750 745850 509
435620 920947 525
608795 112769 470
277333 485615 449
965096 361233 525
751755 755730 424
780195 54330 509
648594 905828 525
479175 251206 449
383290 503076 449
738612 494142 509
560850 940621 525
884473 379711 525
337393 770111 509
792948 656441 504
982791 714024 525
836682 124429 509
989127 461251 525
891053 226555 525
105528 114889 354
675445 470446 509
702869 90295 509
50131 776260 509
104815 13148 351
402068 384055 436
921278 96669 525
768721 612598 509
560291 843828 525
287476 397946 441
49721 744123 509
889579 331572 525
847072 857713 419
617446 802292 509
667827 797570 504
826934 555624 509
432873 522804 470
195684 875804 525
300036 188446 443
936971 947361 507
942581 284858 525
806274 213519 509
360943 286564 441
706534 868835 525
804631 624462 509
405826 654779 509
292376 33968 443
808788 651555 504
904695 330303 525
526540 930102 525
549275 797515 509
975344 688716 525
405326 653749 509
190898 408820 443
