386116 794690 509
391697 806083 509
608096 96639 470
711491 253853 509
512459 278954 470
335122 935654 525
826306 704344 504
446267 95292 449
132348 225886 386
124986 828812 509
230872 287310 407
118367 325679 443
570958 303141 470
826233 281368 509
150994 159451 383
344289 314534 384
170039 697341 509
260810 755318 509
696748 901096 525
374614 626029 470
90028 320542 443
507186 114236 449
961605 442725 525
162409 868131 525
577203 536450 452
643696 326123 509
411042 310783 449
418648 94494 449
435107 62536 449
363052 688935 509
752804 84837 509
370359 775982 509
953192 187972 525
69618 347785 443
412414 433234 418
964742 41565 525
658874 446273 509
665427 199304 509
118231 211582 383
991528 379982 525
598921 936087 525
82397 53848 351
974057 848612 507
220467 542930 470
296146 393816 441
863746 997514 507
437640 834658 509
560444 929432 525
589253 119519 470
989487 490002 525
636839 285195 509
157265 487283 449
636880 733571 504
908273 658732 525
71639 31592 340
661273 817391 504
538348 870969 525
120041 391887 443
184305 86577 383
535563 835842 509
151628 446578 449
394344 445428 449
608621 132898 470
603779 627768 509
146770 68907 375
683275 34875 509
341440 289915 384
969966 610597 525
513053 184250 470
498653 241127 449
790353 239843 509
607388 860996 525
346615 296262 441
589646 32580 470
49522 777821 509
344819 597841 470
206629 720495 509
497728 457460 444
164973 174585 352
848787 65846 525
73517 579034 470
907543 716402 525
486563 92359 449
258669 678283 509
804945 805685 375
972826 720173 525
591129 902650 525
675428 728939 504
913964 971990 507
986150 285597 525
250684 808966 509
766144 461990 509
341456 346393 441
496298 552062 470
7595 752561 509
449425 256746 449
302419 890136 525
295769 473011 449
8428 71901 340
170075 881621 525
37101 367431 443
968194 669270 525
392636 584846 470
474124 149627 449
854106 36867 525
735880 525520 509
475683 919626 525
465679 960690 525
842253 99817 525
544412 315295 470
608453 828670 509
849153 226936 525
764384 863786 525
849610 42911 525
88378 914432 525
540123 849753 525
953570 689151 525
852996 686743 525
212548 349039 443
746560 656349 504
250754 102892 443
336404 740694 509
29740 577114 470
330826 735335 509
550503 969936 525
202582 501581 449
256017 960600 525
952364 820064 525
823115 17958 509
633811 764959 504
255430 35151 443
97781 266411 443
802139 569380 509
398043 567177 470
71892 397993 443
409792 179930 443
965202 76732 525
236745 560587 470
268821 948390 525
920603 545788 525
450715 243898 449
997708 808277 525
922198 121270 525
308100 664309 509
37402 940340 525
852554 456569 525
218154 102035 386
117093 642698 509
435929 135937 449
812863 115397 509
863868 741635 525
950834 175995 525
649664 374413 509
187624 368761 443
925621 33679 525
85719 236011 443
456965 234937 449
781578 283467 509
414403 712556 509
641736 42124 509
773797 449096 509
497625 339766 449
953446 152022 525
16895 468506 449
639257 483611 509
40798 117943 354
69634 251325 443
303602 504119 449
270424 896730 525
6823 416321 449
311086 444807 449
523351 697587 509
175868 63884 383
403778 108428 443
298801 528639 470
254745 219688 443
65255 551980 470
24012 741413 509
733725 938226 525
884144 202509 525
61303 43109 340
602480 484082 470
424878 565679 470
189508 7782 383
359804 309618 441
235281 683917 509
676557 177362 509
330870 126887 443
438770 705694 509
914314 650754 525
156480 233474 443
245194 801546 509
762719 932098 525
500313 958676 525
376843 943484 525
572605 934453 525
581468 539882 452
422021 75511 449
378621 165687 443
721812 204082 509
904589 647645 525
274688 137976 443
613560 408180 470
481585 91591 449
147846 872698 525
328927 288798 384
70676 885178 525
705010 479329 509
120550 551141 470
550517 873791 525
813204 303301 509
30651 272902 443
246997 281693 407
