56782 890451
123456 98765
753420 246801
11111 555555
789456 123789
654321 987654
234567 543210
876543 12345
345678 876543
345679 654321
987655 123456
543211 789456
111112 777777
555556 222222
666667 444444
888889 999999
11112 222222
333334 444444
555556 666666
777778 888888
12346 67890
54322 98765
24681 75309
13580 97531
75310 30975
97532 13579
86421 24680
98766 54321
67891 12345
987655 123456
654322 789456
234568 876543
876544 234567
789457 654321
123457 987654
753421 543210
11112 111111
222223 333333
444445 555555
666667 777777
888889 999999
12346 54321
67891 98765
24681 75310
13580 86421
97532 13580
86421 24681
98766 54322
123457 654322
789457 876544
234568 753421
543211 123457
111112 777778
555556 222223
666667 444445
888890 999999
11113 222223
333335 444445
555557 666667
777779 888889
12347 67891
54323 98766
24682 75311
13581 86422
97533 13581
86422 24682
98767 54323
123458 654323
789458 876545
234569 753422
543212 123458
111113 777779
555557 222224
666668 444446
888891 999999
11114 222224
333336 444446
555558 666668
777780 888890
12348 67892
54324 98767
24683 75312
13582 86423
97534 13582
86423 24683
98768 54324
123459 654324
789459 876546
234570 753423
543213 123459
111114 777780
555558 222225
666669 444447
888892 999999
11115 222225
333337 444447
555559 666669
777781 888891
12349 67893
54325 98768
24684 75313
13583 86424
97535 13583
86424 24684
98769 54325
123460 654325
789460 876547
234571 753424
543214 123460
111115 777781
555559 222226
666670 444448
888893 999999
11116 222226
333338 444448
555560 666670
777782 888892
12350 67894
54326 98769
24685 75314
13584 86425
97536 13584
86425 24685
98770 54326
123461 654326
789461 876548
234572 753425
543215 123461
111116 777782
555560 222227
666671 444449
888894 999999
11117 222227
333339 444449
555561 666671
777783 888893
12351 67895
54327 98770
24686 75315
13585 86426
97537 13585
86426 24686
98771 54327
123462 654327
789462 876549
234573 753426
543216 123462
111117 777783
555561 222228
666672 444450
888895 999999
11118 222228
333340 444450
555562 666672
777784 888894
12352 67896
54328 98771
24687 75316
13586 86427
97538 13586
86427 24687
98772 54328
123463 654328
789463 876550
234574 753427
543217 123463
111118 777784
555562 222229
666673 444451
888896 999999
11119 222229
333341 444451
555563 666673
777785 888895
12353 67897
54329 98772
24688 75317
13587 86428
97539 13587
86428 24688
98773 54329
123464 654329
789464 876551
234575 753428
543218 123464
111119 777785
555563 222230
666674 444452
888897 999999
11120 222230
333342 444452
555564 666674
777786 888896
12354 67898
54330 98773
24689 75318
13588 86429
97540 13588
86429 24689
98774 54330
123465 654330
789465 876552
234576 753429
543219 123465
111120 777786
555564 222231
666675 444453
888898 999999
11121 222231
333343 444453
555565 666675
777787 888897
12355 67899
54331 98774
24690 75319
13589 86430
97541 13589
86430 24690
98775 54331
123466 654331
789466 876553
234577 753430
543220 123466
111121 777787
555565 222232
666676 444454
888899 999999
11122 222232
333344 444454
555566 666676
777788 888898
12356 67900
54332 98775
24691 75320
13590 86431
97542 13590
86431 24691
98776 54332
123467 654332
789467 876554
234578 753431
543221 123467
111122 777788
555566 222233
666677 444455
888900 999999
11123 222233
333345 444455
555567 666677
777789 888899
12357 67901
54333 98776
24692 75321
13591 86432
97543 13591
86432 24692
98777 54333
123468 654333
789468 876555
234579 753432
543222 123468
111123 777789
555567 222234
666678 444456
888901 999999
11124 222234
333346 444456
555568 666678
777790 888900
12358 67902
54334 98777
24693 75322
13592 86433
97544 13592
86433 24693
98778 54334
123469 654334
789469 876556
234580 753433
543223 123469
111124 777790
555568 222235
666679 444457
888902 999999
11125 222235
333347 444457
555569 666679
777791 888901
12359 67903
54335 98778
24694 75323
13593 86434
97545 13593
86434 24694
98779 54335
123470 654335
789470 876557
234581 753434
543224 123470
