413207 191878 449
285496 118526 443
84518 158773 383
387554 61780 443
116447 150841 375
65905 293791 443
95716 493372 449
350392 272985 441
350910 45087 443
317843 69704 443
268048 59099 443
117890 263507 443
156281 394135 443
409779 415538 449
132913 401611 443
55321 484429 449
420566 163757 449
123264 171079 383
148995 401373 443
202020 438834 449
74851 184455 383
487776 243649 449
484130 248426 449
369077 297293 441
146694 436455 449
268635 84796 443
28442 114950 354
36828 241431 443
195661 115579 383
308845 453250 449
248436 186373 443
16708 141708 354
276108 244398 407
31677 3134 308
146800 251796 443
497348 492525 426
344083 220803 443
482217 138451 449
33808 57275 340
364340 39761 443
108917 459013 449
69320 309908 443
48259 114056 354
173106 196999 365
335237 113426 443
278393 171015 443
435024 285594 449
452571 36839 449
165870 205844 365
99672 297688 443
453328 166871 449
225327 338917 443
156275 165970 370
135603 157761 383
196661 375877 443
1901 489628 449
477837 347305 449
362170 235653 441
393664 135642 443
6937 368671 443
10910 455891 449
96100 449847 449
111964 172559 383
391001 158159 443
441986 172195 449
92051 142563 354
457470 222661 449
490605 399638 449
162282 493918 449
374091 253796 441
109654 6428 354
56016 81911 351
442120 303132 449
191044 118710 383
334287 77632 443
213818 148489 383
344188 340779 353
192690 252346 443
154316 180883 383
371730 218227 443
309619 28686 443
58203 495492 449
371803 267159 441
373774 421266 449
446747 319762 449
458975 326608 449
16810 63325 340
470218 98733 449
176810 232222 443
2843 281343 443
251189 438007 449
227744 236586 443
270818 495430 449
84553 398174 443
275559 115572 443
417818 483452 444
105606 131189 354
396865 318927 441
383780 380946 374
475133 405522 449
217800 52290 386
85229 91567 333
293705 290864 358
340711 286625 389
405806 155883 443
423512 81356 449
409413 147368 443
475719 371070 449
191014 32591 383
243525 282490 407
428230 224155 449
1743 31880 308
197003 151798 383
27886 59212 340
143812 152296 370
299390 486211 449
192726 425306 449
489054 456755 444
145054 52874 375
417069 343100 449
488656 54495 449
414752 180175 449
213171 469498 449
458586 127508 449
471114 422019 444
249606 269071 407
20987 212111 383
155286 13578 375
451206 441128 387
429510 294941 449
314630 136605 443
148059 371921 443
157559 317337 443
146072 133921 375
220238 147183 386
169872 433481 449
303926 393064 441
423396 306970 449
390419 470907 449
33948 88595 351
324418 343974 384
146828 292343 443
489174 152743 449
178529 9671 383
483913 350044 449
284961 251093 407
97099 29809 351
303939 96493 443
310991 382621 441
70089 133498 354
405207 120485 443
132939 208250 383
266800 379378 441
91678 287108 443
274863 206513 443
319061 195007 443
95434 156045 375
222357 232428 443
275999 102558 443
183266 25456 383
142357 345522 443
240625 207172 443
293457 402463 441
208031 264706 443
52324 175531 383
198682 455451 449
197356 287516 443
124613 210436 383
216829 207684 386
307731 8814 443
322165 44853 443
80375 335279 443
246514 415980 449
18918 257652 443
277637 319088 389
428320 77285 449
474959 358215 449
371570 358451 410
360935 340068 441
91214 273258 443
43671 395704 443
11849 159735 383
320996 97432 443
51607 497674 449
144820 147658 357
144345 464982 449
212599 355393 443
459410 120304 449
93217 471924 449
95459 83646 333
324105 326747 384
9797 231613 443
425236 153467 449
16107 397528 443
179631 52383 383
179485 303115 443
131603 122401 344
267446 38049 443
337977 12736 443
188405 5201 383
336849 147833 443
78295 66563 351
355238 84998 443
278738 402426 441
291858 329052 384
20023 358723 443
218857 66186 386
420271 163895 449
402139 394264 405
70782 394189 443
189137 16361 383
171110 238512 443
183216 7444 383
291803 279741 389
418701 22470 449
487470 171710 449
329038 167682 443
252942 380961 441
491696 122445 449
216986 136498 386
420219 344457 449
22423 386116 443
82063 269013 443
55908 64757 335
31883 487583 449
455783 404447 449
309708 290033 371
334487 119295 443
425490 357188 449
86100 79429 320
133809 367285 443
443822 164982 449
147512 451055 449
143723 439906 449
437167 207705 449
177515 273555 443
417716 57161 449
48444 289595 443
347806 227704 443
30623 465738 449
60886 63085 335
207587 320143 443
102146 413739 449
7831 279430 443
496885 21404 449
431896 56148 449
127658 389670 443
117373 250283 443
115551 22595 354
480353 166455 449
372444 370877 348
135724 284075 443
54428 3134 340
275558 142951 443
289151 370155 441
256094 463021 449
274465 67706 443
202819 377864 443
29418 231717 443
242493 83563 443
201135 490745 449
345888 349120 441
245896 392168 441
174381 107811 383
90045 123599 354
233664 116586 443
110822 339615 443
340553 264088 407
426353 258675 449
116657 109113 349
183519 259898 443
114317 236524 443
251225 252619 319
314572 41265 443
74342 80797 351
416919 358954 449
80938 340025 443
324139 388929 441
38262 390150 443
217020 100668 386
