832712 973364 525
266511 64554 443
533827 122848 470
27258 617410 470
420929 685673 509
385931 542708 470
158818 184046 370
778572 18496 509
313442 410946 449
776719 869838 525
286537 824180 509
213768 837389 509
942398 596611 525
886973 455529 525
281396 198558 443
159270 105760 383
175060 355328 443
397095 684162 509
936106 434757 525
173953 866789 525
562705 981036 525
925308 896710 476
895960 95697 525
896945 456128 525
925084 444057 525
326112 591667 470
839380 731862 525
88967 462977 449
653421 125397 509
300656 567054 470
300694 857632 525
221132 943309 525
745845 623809 509
848560 316510 525
788436 41578 509
909351 325240 525
534279 315596 470
408234 538017 470
814299 656569 504
557591 646617 509
799985 826564 450
192970 129882 383
392282 252980 441
432462 839432 525
220608 219599 355
583912 144616 470
426749 671461 509
183507 368758 443
363240 781118 509
635952 84661 509
680490 370453 509
8452 976337 525
826044 999919 525
953677 793250 525
612912 210887 470
754164 762388 380
209059 42106 383
183110 838304 525
299374 656876 509
807142 362408 509
282443 91686 443
536749 660442 509
310992 114954 443
449559 745086 509
326938 543732 470
1697 254784 443
479037 733530 509
768195 420305 509
77071 158587 383
747770 795436 468
471776 258260 449
109461 310311 443
654242 268672 509
17723 538580 470
800013 734432 468
607517 989458 525
101296 572231 470
202194 354642 443
772212 259641 509
518480 893085 525
45195 6461 324
677351 84397 509
466701 617880 470
8061 584738 470
613249 365097 470
947967 386121 525
93255 842239 525
271107 59738 443
410039 227610 449
40752 108539 354
420147 383894 449
621407 482178 470
467030 465265 369
37469 750750 509
318616 166389 443
888035 296817 525
655623 637212 416
959785 127539 525
554826 308879 470
332254 198518 443
91327 513449 470
796695 58896 509
374770 2641 443
592162 152635 470
546402 708216 509
419952 885621 525
504088 326221 449
431552 870736 525
710675 476115 509
48022 562690 470
31199 696409 509
697073 830759 504
760247 862658 525
631267 16509 509
974822 791983 525
303318 837397 509
462331 581759 470
462371 754576 509
659064 730883 504
975631 967187 458
116854 366571 443
172453 542456 470
413865 706750 509
923944 506212 525
223490 213334 386
130955 768753 509
456968 152300 449
419936 956683 525
544044 636202 509
998623 723665 525
559926 382219 470
719416 313044 509
140705 501950 449
315825 118492 443
96624 975332 525
503180 860137 525
815654 215399 509
429433 605734 470
864642 600726 525
532813 443993 470
865775 734285 525
595291 163826 470
463308 101736 449
546580 651142 509
302457 568240 470
256465 792695 509
242194 484426 449
85730 846318 525
359602 2823 443
151125 258415 443
401963 593708 470
900331 327671 525
206754 287209 443
603618 141247 470
995155 347104 525
483674 987868 525
424503 811059 509
870959 909058 445
752940 212972 509
446176 69055 449
789774 712882 468
662754 730391 504
553129 833778 509
908998 132991 525
527461 89186 470
728138 570665 509
49400 976201 525
721700 531165 509
260754 891266 525
975289 958446 458
451549 86984 449
465259 394712 449
440514 874823 525
534659 138031 470
731347 884915 525
842308 273649 525
211457 229894 386
800973 523269 509
938285 349825 525
702540 394859 509
980064 712449 525
537040 985127 525
365707 206045 443
992934 393726 525
475000 753364 509
487392 860681 525
630970 329596 509
249407 369503 441
721195 118248 509
656728 739915 504
100688 440844 449
790496 870394 525
758074 697205 504
105842 82178 341
773451 479130 509
958340 998531 458
64820 263167 443
917548 689775 525
784000 925559 525
803444 343165 509
279528 935617 525
129218 638040 509
475695 172795 449
728410 800217 468
269596 215061 443
915504 157233 525
728421 726279 349
132066 866265 525
864525 887262 445
125191 115190 349
