790938 306328 509
662085 256448 509
193858 313228 443
371811 502983 449
696814 193859 509
356199 680260 509
439099 96140 449
636044 384165 509
897203 149679 525
843076 331018 525
38121 788840 509
975765 660945 525
960160 6233 525
729595 338010 509
87119 826763 509
618582 911305 525
46423 945282 525
621491 22560 470
326472 154754 443
77864 7444 351
314689 623233 470
314192 29303 443
871967 823592 525
973917 686744 525
579716 53542 470
528107 408254 470
240504 161599 443
59290 359057 443
643636 371434 509
285616 966438 525
244652 477720 449
922979 125424 525
830581 144107 509
433735 719199 509
920235 946450 507
919418 701968 525
679213 232931 509
315873 596781 470
155407 903605 525
3328 187233 383
733471 972666 525
985672 54711 525
68019 166070 383
148980 793026 509
485430 305601 449
814874 397128 509
216692 687272 509
370959 628432 509
155611 970195 525
879982 458833 525
833560 288390 509
474277 461208 444
66648 222141 386
962678 564901 525
475736 397789 449
41740 994413 525
31009 52158 324
441748 790333 509
852441 855389 419
383784 973599 525
209577 117279 383
180330 912697 525
671521 589334 509
17065 820377 509
6340 265593 443
12559 816722 509
496488 743828 509
831839 970950 525
827285 973263 525
156941 904255 525
747127 819584 468
347210 507727 449
512436 935690 525
114331 472774 449
69545 615560 470
632555 859038 525
624779 847278 525
100024 454694 449
74407 171152 383
440747 393728 449
970908 35420 525
561737 277283 470
632400 866157 525
730119 141805 509
893464 704376 525
728211 853409 525
305070 314491 384
220778 616300 470
967787 737249 525
160267 902710 525
378278 923157 525
688083 916542 525
572319 226866 470
169566 477615 449
215872 490679 449
849031 63399 525
414356 604880 470
678542 755032 504
889159 25134 525
284652 518391 470
707125 231496 509
988367 38009 525
407159 976561 525
223675 960186 525
378681 202827 443
402124 596606 470
468278 159012 449
318950 331006 384
503188 655569 509
365636 254512 441
501091 295847 449
252966 250059 332
452430 650139 509
566415 45455 470
271182 441660 449
125643 336925 443
325536 750086 509
608219 22007 470
731131 263227 509
577504 376938 470
838370 517588 525
767906 854432 525
110723 83803 354
662517 349777 509
166409 729665 509
66802 112701 354
574672 854899 525
452295 221692 449
78591 104141 341
326889 758661 509
338040 906414 525
581731 733481 509
456792 68410 449
22599 127477 354
28387 722834 509
203729 698419 509
397408 659366 509
484591 565 449
254181 317979 407
742707 391164 509
135381 604432 470
620763 213009 470
713764 936070 525
609562 574285 434
365676 738566 509
711946 247602 509
479278 28405 449
326223 971761 525
509012 727688 509
567700 79437 470
533604 184604 470
93967 244503 443
343036 355144 441
223489 276674 443
158016 676846 509
584224 21573 470
633900 480201 509
808060 479922 509
618824 932936 525
879245 85262 525
720880 801937 468
817229 169066 509
972022 824672 525
33929 906396 525
618309 992430 525
923396 709499 525
153487 231441 443
561703 569319 421
660453 414831 509
876217 775150 525
665180 325143 509
785458 126359 509
829474 380800 509
899313 862680 445
730186 392285 509
652249 230742 509
429019 408620 449
929064 398444 525
437343 503313 444
343335 44481 443
609939 646421 509
379133 157615 443
982433 13131 525
882663 101815 525
825379 813712 450
50121 731388 509
205870 957812 525
968839 403588 525
600846 520929 452
131122 558245 470
904600 628683 525
184295 269880 443
882034 481097 525
74306 44971 340
248663 869321 525
438925 634952 509
852056 438697 525
54959 358207 443
59549 862900 525
969977 390570 525
581098 838888 525
550366 347390 470
312147 973273 525
455532 892058 525
56966 276687 443
881249 457758 525
815224 639811 504
435989 229862 449
827979 305584 509
679384 867452 525
957331 985017 458
216183 873378 525
601845 783268 509
151560 703165 509
836858 80009 509
169499 838620 525
937149 205444 525
86798 701244 509
255101 292809 407
763572 125538 509
784684 131144 509
131807 222546 386
382649 965863 525
673730 361080 509
56677 413577 449
924785 670573 525
662540 641319 429
587514 178995 470
842282 898793 445
174908 76449 383
38138 795877 509
522834 152905 470
7082 145311 375
44750 118991 354
56138 700768 509
487669 833501 509
836261 456709 509
945103 201619 525
576290 60297 470
784611 516343 509
21152 864631 525
970167 419963 525
119281 27758 354
829197 829983 375
222195 6512 386
287512 585394 470
129934 738465 509
596574 170389 470
748925 613173 509
535681 213202 470
987554 719851 525
576757 249108 470
95811 297618 443
461208 541167 470
533621 385408 470
978220 246830 525
120306 742981 509
417125 664122 509
