863595 973185 507
397736 302404 441
512392 474576 470
146899 940683 525
825764 473254 509
72373 747160 509
247447 787693 509
994241 919938 507
211396 901208 525
448678 996299 525
117311 34411 354
972512 919285 507
398702 332105 441
116656 673352 509
306048 99183 443
493304 417260 444
979759 926166 507
413961 116232 449
78636 70633 351
581935 488506 470
461603 242953 449
119890 415050 449
179961 633747 509
374333 320667 441
300359 40953 443
389675 938242 525
358709 718511 509
680385 383853 509
894794 616298 525
745384 420963 509
601942 54599 470
27940 308970 443
442888 31790 449
894312 406453 525
140621 190199 383
399455 387560 436
433132 107181 449
893335 587832 525
248980 515817 470
887190 827725 525
879766 690494 525
333926 526833 470
354287 907800 525
363308 440406 449
530685 272485 470
592226 893194 525
869807 970765 507
300892 879595 525
130610 580987 470
132205 683835 509
67909 898213 525
854126 754608 525
533513 846812 525
664595 660486 367
394999 701311 509
512091 981229 525
809712 154605 509
832078 511021 509
282557 92598 443
595532 486681 470
753639 392442 509
532609 975722 525
384134 646475 509
925691 860899 476
729642 824603 468
303396 264556 407
305721 788825 509
548629 51053 470
490207 453946 444
183332 448309 449
829125 414346 509
568109 461702 470
931562 310186 525
203421 852643 525
900442 32712 525
321357 996130 525
581430 774534 509
561070 208713 470
733081 131090 509
641473 783351 504
533063 427927 470
180199 993068 525
554997 208916 470
195222 872828 525
916037 539095 525
284041 887480 525
11579 616847 470
591633 798101 509
763245 703270 504
338931 938669 525
186676 256824 443
905261 222289 525
207822 570046 470
364793 615454 470
145265 622570 470
243839 383782 441
186815 819065 509
973823 414470 525
115704 198911 383
146761 988570 525
92881 96352 328
636129 100377 509
245395 856375 525
74800 744089 509
867904 462609 525
83189 182459 383
658782 878063 525
829280 101646 509
665076 282863 509
590168 445662 470
967202 209330 525
678187 11804 509
250263 544536 470
104231 669347 509
761921 854820 525
453510 758830 509
674252 445304 509
132592 257359 443
231405 318028 407
12440 176248 383
660206 690689 442
478755 116057 449
804955 248531 509
778156 430732 509
887623 932241 476
890258 551309 525
935531 493377 525
497228 497165 245
669229 277102 509
833419 859405 525
544074 277798 470
445413 944179 525
442491 876670 525
403304 509458 449
10466 444063 449
917011 429784 525
211850 886563 525
318821 529800 470
589445 246311 470
501534 10257 449
661028 879008 525
73184 658216 509
782608 603401 509
9874 383935 443
932859 104374 525
48164 988461 525
360632 34963 443
125130 957162 525
357949 544161 470
723521 89539 509
255151 683281 509
44962 478402 449
709456 903743 525
285547 135777 443
516243 399353 470
321524 380229 441
523066 862746 525
418067 8766 449
400893 655941 509
805591 813845 406
689535 365001 509
526056 377417 470
281913 463039 449
714523 170442 509
521041 744310 509
676387 225468 509
217492 727371 509
524498 438213 470
51939 293618 443
248142 676308 509
282051 271404 389
888789 17426 525
648333 985487 525
287433 170082 443
679034 708926 504
991746 111111 525
906194 121501 525
345426 715586 509
638910 601743 509
831237 465621 509
364524 600192 470
556380 754816 509
418672 977240 525
492838 72505 449
119066 503460 449
496725 803253 509
141528 906930 525
515900 868719 525
869593 602221 525
785092 450527 509
442597 662113 509
391928 405114 405
962280 718282 525
398132 325949 441
568628 286601 470
556182 406060 470
639517 391476 509
157457 875860 525
399549 118201 443
655560 501739 509
181964 272332 443
948510 911025 507
12431 173943 383
330059 862590 525
764610 221288 509
703132 608904 509
818604 838661 525
531854 467281 470
598805 765295 509
562581 172667 470
514390 232680 470
393479 839017 525
924685 107994 525
846572 757048 525
9122 548055 470
166624 553714 470
345885 883770 525
611938 83172 470
270286 202367 443
314919 236695 407
247976 697741 509
479440 859279 525
821812 372281 509
355561 850918 525
948391 153603 525
451292 285034 449
142916 395228 443
124356 612653 470
233071 658593 509
100303 456559 449
127121 523986 470
142652 690568 509
327055 67318 443
89820 989669 525
57422 732148 509
348714 657524 509
495126 366232 449
551440 408142 470
903182 677198 525
586690 117224 470
755624 29254 509
656343 367951 509
54688 530127 470
958818 980378 458
114361 674754 509
395140 427423 449
752582 655678 504
655528 781565 504
617813 273471 470
632171 981526 525
