2741 1556 209
217 9432 262
5 9872 262
3596 2076 217
7776 9595 260
8453 8914 216
6097 8237 262
3079 5686 238
2385 88 183
4492 7791 262
8178 7108 252
4255 29 238
3707 430 217
9128 3787 262
6329 2525 262
7746 4482 262
1328 5063 238
1056 7447 262
4417 6223 262
122 6646 262
8112 2238 262
1244 1127 182
579 6702 262
5329 2684 238
1743 7451 262
5169 9778 262
1564 6569 262
8814 1267 262
7033 1349 262
7970 5818 262
511 8925 262
768 5779 238
3010 3303 199
1756 3613 217
8904 4735 262
1722 2666 209
3503 7170 262
7525 1436 262
5734 2020 238
4833 4185 215
6451 6820 244
1613 1123 182
8091 8230 190
3735 895 238
6952 608 262
49 3262 217
673 2375 183
6956 3616 262
9757 6251 260
796 6245 262
1484 7897 262
6640 6321 244
7307 7470 239
1976 3020 217
1858 6363 262
6305 3502 262
7989 5569 262
9512 4562 262
3761 7979 262
4567 8016 262
5076 5246 179
4295 7030 262
9715 8784 260
9598 9416 198
2770 7459 262
1602 3727 238
23160 49822 324
57783 45332 340
1217 42510 324
64264 53616 335
70528 22830 340
54512 30523 340
27296 85005 351
21713 11636 279
39097 86353 351
79303 63795 351
79415 580 351
12198 79028 351
96983 48540 351
9876 2807 262
75355 61506 330
3642 19251 279
9517 20571 279
46259 99464 351
28568 86722 351
31109 6580 308
30526 47647 324
78837 9044 351
94298 48847 351
80804 23451 351
70196 59498 335
77917 818 351
85286 71836 351
83114 55248 351
93050 71316 351
80709 81380 320
14279 93323 351
49450 23849 324
49220 43163 314
15335 62760 340
14573 51532 324
87681 39139 351
39984 94581 351
10738 3853 262
50863 63806 340
1091 75220 340
36967 77856 351
70184 75439 325
47353 29161 324
96677 9392 351
45051 86867 351
58620 96251 351
7287 563 262
91551 70046 351
53227 49802 340
26156 65286 340
37493 53880 340
33825 96905 351
12995 57309 340
88639 8925 351
98989 98031 284
74659 29168 340
3711 82151 351
70000 41389 340
80518 35792 351
28870 21807 308
79518 52650 351
39356 31744 324
59358 20113 340
1100 63297 340
32040 49759 324
28542 39789 324
46165 13552 324
68999 55057 335
39124 11299 324
47947 85384 351
8204 49887 324
5980 97461 351
60503 8141 340
43851 92099 351
54476 9149 340
73650 49748 340
74096 88880 351
76427 3328 340
72053 63308 330
22598 60075 340
5829 14608 276
28712 9903 308
42799 35602 324
84470 11901 351
79233 54870 351
59830 2190 340
49948 99394 351
14142 66396 340
3343 51268 324
47310 78198 351
74487 39086 340
70071 60212 335
97374 59676 351
61860 45250 340
1556 26356 282
75682 46155 340
89436 8054 351
61170 59000 335
95952 74496 351
61316 22753 340
87809 79199 333
77250 92999 338
8403 4394 262
73843 61814 330
73584 70194 325
59220 21275 340
61891 96176 351
79473 19663 351
61242 70995 330
66690 30435 340
9323 9516 198
3447 7137 262
7668 5156 262
5878 7725 262
1112 4941 238
5860 273 238
3689 6211 262
4443 3955 215
4428 4601 184
2737 9902 262
3051 1202 217
9874 6829 260
6172 5824 262
7874 8475 252
1100 6802 262
352 7943 262
5871 8888 262
2559 8525 262
5486 1760 238
7825 6058 262
6667 5178 262
3684 6252 262
3381 2177 217
47 3967 238
1989 937 182
5444 2480 238
9817 7779 260
1676 2874 209
9023 5359 262
1810 5087 238
8914 3411 262
3589 8534 262
303 2160 182
1551 3430 217
