299503 380283
236928 482078
552284 517988
329317 452542
299329 371682
390717 416992
997872 319703
596063 634948
955975 529936
972736 303570
987764 416577
450033 804843
484291 752062
85304 26589
806462 870059
436047 515064
530185 781380
506461 803690
567767 313939
929074 882336
27440 623244
552323 36353
341727 290699
967333 858615
819217 141965
344079 467665
704498 242283
90051 172256
694427 61522
355133 463162
97426 116747
643554 150850
68639 494864
621429 112057
292904 54088
642409 91826
926655 814042
153558 475859
463871 993475
525967 696019
810115 316016
50956 886790
955771 931264
210818 687530
691214 339813
849310 929732
113496 550556
372169 953202
599657 666600
677959 947442
309820 921425
308084 800500
166007 754760
164721 313592
647525 501051
444032 626231
797904 103238
793492 699294
88294 552940
975775 804570
35673 474017
373947 653214
356449 903499
771003 101570
699026 501799
989369 647250
878705 364288
815385 520852
869249 846839
522578 475360
216289 3338
106251 238178
470594 177558
9222 972292
990993 740200
587897 561458
291419 577592
289308 983707
474002 12860
182123 785898
49188 522525
819037 821166
828328 140904
944964 282840
228062 264616
78155 271317
221847 613139
240062 500444
984429 815738
116443 455964
870174 282888
407448 872278
434739 749231
589359 629350
405847 971186
81706 486466
23756 261304
69635 811414
834065 313301
966287 247646
773424 481152
104712 340619
150660 35255
256350 425253
847151 323878
362520 444545
244818 507081
27390 275364
650291 422280
208786 168190
604299 865166
296336 271139
610778 582429
231770 813139
743014 420700
969940 411813
310249 158848
106615 937589
23324 154378
114753 608506
996052 892405
212625 862516
197847 506385
307105 645282
4194 897783
880262 230586
959998 414022
793590 736936
803496 619916
244460 808001
566942 879947
358628 937945
571704 707987
878538 54268
605328 696200
918052 101819
62126 501186
881423 486553
380026 591027
761151 852322
379611 272247
264284 381832
442662 649200
344323 107029
629665 732319
755868 880851
100559 658827
734497 92965
149962 924367
219627 246797
206208 183007
134952 131456
380952 997614
595879 608787
412545 64658
665138 930907
721521 785718
929756 87028
670229 161618
997553 220973
330259 578466
376223 403359
908666 121021
692084 148033
520058 567360
302786 865369
824416 437180
686610 344800
768314 14877
386042 44948
993368 129576
978154 639463
93639 134659
584351 547651
10941 153662
609455 903889
888245 223144
579393 767677
615561 253709
722681 885758
780100 489423
30191 129158
144625 538683
315694 614556
272471 39978
794073 452011
732410 677148
670081 448638
962895 9878
396591 160373
198959 487068
527589 736007
905425 928568
981299 897008
562163 511012
304640 394643
54438 994207
714846 579862
672283 910998
348689 281924
683869 334368
724130 791977
573899 329424
905112 1798
912708 697177
107123 426023
444789 872618
867141 874362
144751 188581
374840 115790
555173 351834
616131 989583
424638 140152
571934 255999
597760 120909
349882 442643
644165 539386
536597 88654
590279 250061
873571 377221
578976 202075
413071 808855
703135 899151
191814 576781
648938 596504
779318 25395
80280 306871
705685 930706
166887 128281
992468 611742
296763 113921
895057 717960
7605 872842
864366 752102
702107 88921
47970 997717
108520 8299
616207 179599
129340 345302
76435 80260
446219 1134
918685 345995
826343 941543
81598 260056
771542 682100
735097 283442
542476 69106
870236 730580
753797 171967
71518 427376
264874 578932
288306 578496
519395 105307
750640 836922
51636 286736
994938 50357
187242 620709
547844 435136
808331 309763
390703 270861
114279 432230
460590 438949
135932 288579
454894 108137
257083 637960
973566 556185
598342 169086
626951 883058
723940 669712
242605 598242
206969 109822
413845 590605
781156 598055
209893 395684
133877 478056
237498 362264
7528 18005
730526 886208
392702 651714
