70299 18962
12203 40893
11099 74299
27919 3118
57874 21184
3910 21235
10339 4359
16047 49571
39548 62496
49934 8277
86759 62177
71415 51815
5028 55733
6623 32254
25861 5141
83333 88856
23720 95573
56256 14026
6284 99145
3190 6156
44372 83218
50608 44578
91398 16940
28729 79658
57491 16670
10604 1491
91264 92205
81928 30571
16390 20185
6020 12200
40672 49532
80041 35353
93951 27478
88764 33785
92728 55778
11291 81269
72047 3423
96215 57497
76710 47743
64195 69247
8090 61895
80152 41698
5740 55663
35008 89303
99720 66942
81288 6931
53918 60879
33159 97337
59595 91
14471 82191
93435 47394
79851 88601
57624 14143
25685 51705
13283 85492
12517 24966
36581 37705
47704 9626
44370 34414
3033 75491
4270 11485
68503 58330
60327 9810
61367 51157
18873 62141
10803 83368
63411 87676
19483 64159
55209 61187
9590 93149
3398 39983
47853 43111
28752 90483
79019 1974
97340 19385
10134 48556
55162 63172
48614 73277
83059 35164
61390 95561
8083 8332
75149 82954
79923 86014
8671 56647
80359 73272
98850 54934
88047 10488
5996 63934
34051 59991
55084 88555
80818 14588
4557 38956
93940 69712
58225 99338
39780 93391
67299 59699
17832 39026
22653 13109
15337 5717
42857 10867
671339 863534
676094 787862
553688 629045
932393 827403
960011 796997
803881 931128
531902 586631
643238 576517
688599 665312
802266 825419
512224 786523
634815 751924
903447 545848
796360 539354
528022 768744
933559 578725
807554 760354
769405 843108
612616 656025
997441 502471
797746 723379
789274 851859
668206 516349
692617 723270
813178 769851
588987 858313
842013 571969
609334 718104
907538 865275
951818 931882
963139 791877
538151 660750
819029 960276
994719 750234
532085 805226
718169 575012
523832 787272
911085 672671
537598 673165
943941 717540
602577 603746
657391 539235
537324 626100
850078 857539
619638 627723
732869 817863
642234 571652
967290 820085
721830 874059
999188 514042
909745 956060
780722 927341
938869 987533
642378 612939
857195 631967
805450 539341
999319 620078
953836 591521
786488 967313
568615 542303
988232 540530
720812 753806
502812 682494
753695 700809
742602 991946
932739 953725
708861 863887
852937 584682
692646 583938
823286 519322
583712 645346
713829 729467
975413 911387
581206 900680
580021 707162
567267 684134
596990 524692
671452 724543
755426 573765
830850 814838
893736 780795
839352 507387
734182 804483
577617 776796
797388 613661
854370 729661
972005 684436
959817 519394
570783 839338
756895 603068
820178 928290
706177 936399
756856 717865
538852 920944
600846 574708
618844 991853
572608 662920
799426 762395
771020 886094
807870 830025
