@startuml
class Product {
  - id: int
  - name: string
  - price: float
  - category_id: int
  - description : String
  - unit_of_measure: String
  - product_type : String
  - in_stock : Boolean
  - color: String
  - discount: int
  - manufacturer : String
  - item_weight : int
  - country_of_origin : String
  + getProduct() : Product
}

class Stock {
  - id: int
  - product_id: int
  - quantity: int
  - warehouse_location_id: int
  - location_type : String
  - barcode : String
  + getProduct() : Product
  + getQuantity() : int
  + getWareHouseLocation() : WareHouseLocation
}

class Quotation {
  - id: int
  - product_id: int
  - quantity: int
  - customer_id: int
  - start_date: Date
  - end_date: Date
  - state: String
  - discount: int
  - total_price: int
  + getProduct(): Product
  + getQuantity(): int
  + getCustomer(): Customer
}

class Sale {
  - id: int
  - product_id: int
  - quantity: int
  - customer_id: int
  - date: Date
  - invoice_address : String
  - delvery_address : String
  - cutomer_tag : String
  - payment_method : String
  - taxes : int
  - untaxed : int
  - total : int
  + getProduct(): Product
  + getQuantity(): int
  + getCustomer(): Customer
}

class ProductCategory {
  - id: int
  - name: string
  + getName(): string
}

class Customer {
  - id: int
  - name: string
  - email: string
  - phone : int
  - alternate_number : int
  - address : string
  - shipping_address : string
  + getName(): string
  + getEmail(): string
}

class WarehouseLocation {
  - id: int
  - name: string
  - location_type : String
  - company : String
  + getName(): string
}

Product "1" -- "*" ProductCategory
Stock "*" -- "1" Product
Stock "*" -- "1" WarehouseLocation
Quotation "*" -- "1" Product
Quotation "*" -- "1" Customer
Sales "*" -- "1" Product
Sales "*" -- "1" Customer
@enduml