module github.com/HamHamChan/goimdbsql

go 1.21.6

require (
	github.com/labstack/echo/v4 v4.11.4
	github.com/proullon/ramsql v0.0.0-20220319205533-582afa8a5528
)

require (
	github.com/go-gorp/gorp v2.2.0+incompatible // indirect
	github.com/labstack/gommon v0.4.2 // indirect
	github.com/mattn/go-colorable v0.1.13 // indirect
	github.com/mattn/go-isatty v0.0.20 // indirect
	github.com/valyala/bytebufferpool v1.0.0 // indirect
	github.com/valyala/fasttemplate v1.2.2 // indirect
	golang.org/x/crypto v0.17.0 // indirect
	golang.org/x/net v0.19.0 // indirect
	golang.org/x/sys v0.15.0 // indirect
	golang.org/x/text v0.14.0 // indirect
)
