^C:\USERS\SILLI\DOCUMENTS\PROJECTS\OHJELMOINTIKIELET_K2023\ZOO\ZOO\ZOO\DATE.CPP
/c /ZI /JMC /nologo /W3 /WX- /diagnostics:column /sdl /Od /Oy- /D WIN32 /D _DEBUG /D _CONSOLE /D _UNICODE /D UNICODE /Gm- /EHsc /RTC1 /MDd /GS /fp:precise /permissive- /Zc:wchar_t /Zc:forScope /Zc:inline /Fo"DEBUG\\" /Fd"DEBUG\VC142.PDB" /external:W3 /Gd /TP /analyze- /FC C:\USERS\SILLI\DOCUMENTS\PROJECTS\OHJELMOINTIKIELET_K2023\ZOO\ZOO\ZOO\DATE.CPP
^C:\USERS\SILLI\DOCUMENTS\PROJECTS\OHJELMOINTIKIELET_K2023\ZOO\ZOO\ZOO\ANIMAL.CPP
/c /ZI /JMC /nologo /W3 /WX- /diagnostics:column /sdl /Od /Oy- /D WIN32 /D _DEBUG /D _CONSOLE /D _UNICODE /D UNICODE /Gm- /EHsc /RTC1 /MDd /GS /fp:precise /permissive- /Zc:wchar_t /Zc:forScope /Zc:inline /Fo"DEBUG\\" /Fd"DEBUG\VC142.PDB" /external:W3 /Gd /TP /analyze- /FC C:\USERS\SILLI\DOCUMENTS\PROJECTS\OHJELMOINTIKIELET_K2023\ZOO\ZOO\ZOO\ANIMAL.CPP
^C:\USERS\SILLI\DOCUMENTS\PROJECTS\OHJELMOINTIKIELET_K2023\ZOO\ZOO\ZOO\SHARK.CPP
/c /ZI /JMC /nologo /W3 /WX- /diagnostics:column /sdl /Od /Oy- /D WIN32 /D _DEBUG /D _CONSOLE /D _UNICODE /D UNICODE /Gm- /EHsc /RTC1 /MDd /GS /fp:precise /permissive- /Zc:wchar_t /Zc:forScope /Zc:inline /Fo"DEBUG\\" /Fd"DEBUG\VC142.PDB" /external:W3 /Gd /TP /analyze- /FC C:\USERS\SILLI\DOCUMENTS\PROJECTS\OHJELMOINTIKIELET_K2023\ZOO\ZOO\ZOO\SHARK.CPP
^C:\USERS\SILLI\DOCUMENTS\PROJECTS\OHJELMOINTIKIELET_K2023\ZOO\ZOO\ZOO\TIGER.CPP
/c /ZI /JMC /nologo /W3 /WX- /diagnostics:column /sdl /Od /Oy- /D WIN32 /D _DEBUG /D _CONSOLE /D _UNICODE /D UNICODE /Gm- /EHsc /RTC1 /MDd /GS /fp:precise /permissive- /Zc:wchar_t /Zc:forScope /Zc:inline /Fo"DEBUG\\" /Fd"DEBUG\VC142.PDB" /external:W3 /Gd /TP /analyze- /FC C:\USERS\SILLI\DOCUMENTS\PROJECTS\OHJELMOINTIKIELET_K2023\ZOO\ZOO\ZOO\TIGER.CPP
^C:\USERS\SILLI\DOCUMENTS\PROJECTS\OHJELMOINTIKIELET_K2023\ZOO\ZOO\ZOO\ZOOMAIN.CPP
/c /ZI /JMC /nologo /W3 /WX- /diagnostics:column /sdl /Od /Oy- /D WIN32 /D _DEBUG /D _CONSOLE /D _UNICODE /D UNICODE /Gm- /EHsc /RTC1 /MDd /GS /fp:precise /permissive- /Zc:wchar_t /Zc:forScope /Zc:inline /Fo"DEBUG\\" /Fd"DEBUG\VC142.PDB" /external:W3 /Gd /TP /analyze- /FC C:\USERS\SILLI\DOCUMENTS\PROJECTS\OHJELMOINTIKIELET_K2023\ZOO\ZOO\ZOO\ZOOMAIN.CPP
^C:\USERS\SILLI\DOCUMENTS\PROJECTS\OHJELMOINTIKIELET_K2023\ZOO\ZOO\ZOO\ZOO.CPP
/c /ZI /JMC /nologo /W3 /WX- /diagnostics:column /sdl /Od /Oy- /D WIN32 /D _DEBUG /D _CONSOLE /D _UNICODE /D UNICODE /Gm- /EHsc /RTC1 /MDd /GS /fp:precise /permissive- /Zc:wchar_t /Zc:forScope /Zc:inline /Fo"DEBUG\\" /Fd"DEBUG\VC142.PDB" /external:W3 /Gd /TP /analyze- /FC C:\USERS\SILLI\DOCUMENTS\PROJECTS\OHJELMOINTIKIELET_K2023\ZOO\ZOO\ZOO\ZOO.CPP
^C:\USERS\TEMEK\DOWNLOADS\ZOO\ZOO\ZOO\ZOO\ANIMAL.CPP
/c /ZI /JMC /nologo /W3 /WX- /diagnostics:column /sdl /Od /Oy- /D WIN32 /D _DEBUG /D _CONSOLE /D _UNICODE /D UNICODE /Gm- /EHsc /RTC1 /MDd /GS /fp:precise /Zc:wchar_t /Zc:forScope /Zc:inline /permissive- /Fo"DEBUG\\" /Fd"DEBUG\VC143.PDB" /external:W3 /Gd /TP /analyze- /FC C:\USERS\TEMEK\DOWNLOADS\ZOO\ZOO\ZOO\ZOO\ANIMAL.CPP
^C:\USERS\TEMEK\DOWNLOADS\ZOO\ZOO\ZOO\ZOO\DATE.CPP
/c /ZI /JMC /nologo /W3 /WX- /diagnostics:column /sdl /Od /Oy- /D WIN32 /D _DEBUG /D _CONSOLE /D _UNICODE /D UNICODE /Gm- /EHsc /RTC1 /MDd /GS /fp:precise /Zc:wchar_t /Zc:forScope /Zc:inline /permissive- /Fo"DEBUG\\" /Fd"DEBUG\VC143.PDB" /external:W3 /Gd /TP /analyze- /FC C:\USERS\TEMEK\DOWNLOADS\ZOO\ZOO\ZOO\ZOO\DATE.CPP
^C:\USERS\TEMEK\DOWNLOADS\ZOO\ZOO\ZOO\ZOO\SHARK.CPP
/c /ZI /JMC /nologo /W3 /WX- /diagnostics:column /sdl /Od /Oy- /D WIN32 /D _DEBUG /D _CONSOLE /D _UNICODE /D UNICODE /Gm- /EHsc /RTC1 /MDd /GS /fp:precise /Zc:wchar_t /Zc:forScope /Zc:inline /permissive- /Fo"DEBUG\\" /Fd"DEBUG\VC143.PDB" /external:W3 /Gd /TP /analyze- /FC C:\USERS\TEMEK\DOWNLOADS\ZOO\ZOO\ZOO\ZOO\SHARK.CPP
^C:\USERS\TEMEK\DOWNLOADS\ZOO\ZOO\ZOO\ZOO\TIGER.CPP
/c /ZI /JMC /nologo /W3 /WX- /diagnostics:column /sdl /Od /Oy- /D WIN32 /D _DEBUG /D _CONSOLE /D _UNICODE /D UNICODE /Gm- /EHsc /RTC1 /MDd /GS /fp:precise /Zc:wchar_t /Zc:forScope /Zc:inline /permissive- /Fo"DEBUG\\" /Fd"DEBUG\VC143.PDB" /external:W3 /Gd /TP /analyze- /FC C:\USERS\TEMEK\DOWNLOADS\ZOO\ZOO\ZOO\ZOO\TIGER.CPP
^C:\USERS\TEMEK\DOWNLOADS\ZOO\ZOO\ZOO\ZOO\ZOO.CPP
/c /ZI /JMC /nologo /W3 /WX- /diagnostics:column /sdl /Od /Oy- /D WIN32 /D _DEBUG /D _CONSOLE /D _UNICODE /D UNICODE /Gm- /EHsc /RTC1 /MDd /GS /fp:precise /Zc:wchar_t /Zc:forScope /Zc:inline /permissive- /Fo"DEBUG\\" /Fd"DEBUG\VC143.PDB" /external:W3 /Gd /TP /analyze- /FC C:\USERS\TEMEK\DOWNLOADS\ZOO\ZOO\ZOO\ZOO\ZOO.CPP
^C:\USERS\TEMEK\DOWNLOADS\ZOO\ZOO\ZOO\ZOO\ZOOMAIN.CPP
/c /ZI /JMC /nologo /W3 /WX- /diagnostics:column /sdl /Od /Oy- /D WIN32 /D _DEBUG /D _CONSOLE /D _UNICODE /D UNICODE /Gm- /EHsc /RTC1 /MDd /GS /fp:precise /Zc:wchar_t /Zc:forScope /Zc:inline /permissive- /Fo"DEBUG\\" /Fd"DEBUG\VC143.PDB" /external:W3 /Gd /TP /analyze- /FC C:\USERS\TEMEK\DOWNLOADS\ZOO\ZOO\ZOO\ZOO\ZOOMAIN.CPP
