{   
    "civilization": "rome",
    "recommendedCapitolCoordinates": "2x2", 
    "squares": {
        "0x0": {
            "type": "mountain",
            "overlay": null,
            "occupants": [],
            "resources": [
                {
                    "type": "production",
                    "count": 1
                }
            ]
        },
        "0x1": {
            "type": "desert",
            "overlay": null,
            "occupants": [],
            "resources": [
                {
                    "type": "trade",
                    "count": 1
                },
                {
                    "type": "incense",
                    "count": 1
                }
            ]    
        },
        "0x2": {
            "type": "mountain",
            "overlay": null,
            "occupants": [],
            "resources": [
                {
                    "type": "production",
                    "count": 1
                }
            ]      
        },
        "0x3": {
            "type": "forest",
            "overlay": null,
            "occupants": [],
            "resources": [
                {
                    "type": "production",
                    "count": 2
                },
                {
                    "type": "silk",
                    "count": 1
                }
            ]        
        },
        "1x0": {
            "type": "water",
            "overlay": null,
            "occupants": [],
            "resources": [
                {
                    "type": "trade",
                    "count": 1
                }
            ] 
        },
        "1x1": {
            "type": "mountain",
            "overlay": null,
            "occupants": [],
            "resources": [
                {
                    "type": "production",
                    "count": 1
                }
            ]        
        },
        "1x2": {
            "type": "desert",
            "overlay": null,
            "occupants": [],
            "resources": [
                {
                    "type": "trade",
                    "count": 1
                }
            ]
        },
        "1x3": {
            "type": "mountain",
            "overlay": null,
            "occupants": [],
            "resources": [
                {
                    "type": "production",
                    "count": 1
                },
                {
                    "type": "iron",
                    "count": 1
                }
            ]     
        },
        "2x0": {
            "type": "forest",
            "overlay": null,
            "occupants": [],
            "resources": [
                {
                    "type": "production",
                    "count": 2
                }
            ]
        },
        "2x1": {
            "type": "mountain",
            "overlay": null,
            "occupants": [],
            "resources": [
                {
                    "type": "production",
                    "count": 1
                }
            ]
        },
        "2x2": {
            "type": "forest",
            "overlay": null,
            "occupants": [],
            "resources": []
        },
        "2x3": {
            "type": "water",
            "overlay": null,
            "occupants": [],
            "resources": [
                {
                    "type": "trade",
                    "count": 1
                }
            ]
        },
        "3x0": {
            "type": "water",
            "overlay": null,
            "occupants": [],
            "resources": [
                {
                    "type": "trade",
                    "count": 1
                },
                {
                    "type": "wheat",
                    "count": 1
                }
            ]
        },
        "3x1": {
            "type": "forest",
            "overlay": null,
            "occupants": [],
            "resources": [
                {
                    "type": "production",
                    "count": 2
                }
            ]
        },
        "3x2": {
            "type": "mountain",
            "overlay": null,
            "occupants": [],
            "resources": [
                {
                    "type": "production",
                    "count": 1
                }
            ]
        },
        "3x3": {
            "type": "water",
            "overlay": null,
            "occupants": [],
            "resources": [
                {
                    "type": "trade",
                    "count": 1
                }
            ]
        }
    }
}