{   
    "civilization": null,
    "recommendedCapitolCoordinates": null, 
    "squares": {
        "0x0": {
            "type": "mountain",
            "overlay": null,
            "occupants": [],
            "resources": [
                {
                    "type": "production",
                    "count": 1
                }
            ]
        },
        "0x1": {
            "type": "desert",
            "overlay": null,
            "occupants": [],
            "resources": [
                {
                    "type": "trade",
                    "count": 1
                }
            ]        
        },
        "0x2": {
            "type": "field",
            "overlay": null,
            "occupants": [
                {
                    "type": "village",
                    "value": {
                        "type": "resource_type",
                        "count": "resource_count"
                    }
                }
            ],
            "resources": []        
        },
        "0x3": {
            "type": "field",
            "overlay": null,
            "occupants": [],
            "resources": []        
        },
        "1x0": {
            "type": "desert",
            "overlay": null,
            "occupants": [],
            "resources": [
                {
                    "type": "trade",
                    "count": 1
                }
            ]        
        },
        "1x1": {
            "type": "mountain",
            "overlay": null,
            "occupants": [],
            "resources": [
                {
                    "type": "production",
                    "count": 1
                }
            ]        
        },
        "1x2": {
            "type": "field",
            "overlay": null,
            "occupants": [],
            "resources": [
                {
                    "type": "culture",
                    "count": 1
                }
            ]        
        },
        "1x3": {
            "type": "forest",
            "overlay": null,
            "occupants": [],
            "resources": [
                {
                    "type": "production",
                    "count": 2
                }
            ]        
        },
        "2x0": {
            "type": "desert",
            "overlay": null,
            "occupants": [],
            "resources": [
                {
                    "type": "trade",
                    "count": 1
                },
                {
                    "type": "incense",
                    "count": 1
                }
            ]
        },
        "2x1": {
            "type": "field",
            "overlay": null,
            "occupants": [],
            "resources": []
        },
        "2x2": {
            "type": "forest",
            "overlay": null,
            "occupants": [],
            "resources": [
                {
                    "type": "production",
                    "count": 2
                }
            ]
        },
        "2x3": {
            "type": "forest",
            "overlay": null,
            "occupants": [],
            "resources": [
                {
                    "type": "production",
                    "count": 2
                }
            ]
        },
        "3x0": {
            "type": "desert",
            "overlay": null,
            "occupants": [],
            "resources": [
                {
                    "type": "trade",
                    "count": 1
                }
            ]
        },
        "3x1": {
            "type": "desert",
            "overlay": null,
            "occupants": [
                {
                    "type": "hut",
                    "value": {
                        "type": "resource_type",
                        "count": "resource_count"
                    }
                }
            ],
            "resources": [
                {
                    "type": "trade",
                    "count": 1
                }
            ]
        },
        "3x2": {
            "type": "desert",
            "overlay": null,
            "occupants": [],
            "resources": [
                {
                    "type": "trade",
                    "count": 1
                }
            ]
        },
        "3x3": {
            "type": "desert",
            "overlay": null,
            "occupants": [],
            "resources": [
                {
                    "type": "trade",
                    "count": 1
                }
            ]        
        }
    }
}