{
  "__ow_method": "get",
  "__ow_query": "resource=acct:echo@bots.gould.cx",
  "__ow_body": "",
  "__ow_headers": {
    "x-forwarded-port": "443",
    "x-global-k8fdic-transaction-id": "3a70808cc5d5fd1d8753bf4ff743d4ff",
    "accept": "*/*",
    "x-request-id": "3a70808cc5d5fd1d8753bf4ff743d4ff",
    "user-agent": "curl/7.47.0",
    "x-client-ip": "70.122.21.19",
    "x-forwarded-proto": "https",
    "host": "us-south.functions.cloud.ibm.com",
    "cache-control": "no-transform",
    "cf-ray": "44fb7e4888ef9b08-DFW",
    "cf-visitor": "{\"scheme\":\"https\"}",
    "cf-connecting-ip": "184.172.114.173",
    "via": "1.1 BgAAAG!zygA-",
    "cf-ipcountry": "US",
    "x-real-ip": "10.74.34.211",
    "x-global-transaction-id": "3011031155",
    "accept-encoding": "gzip",
    "x-forwarded-host": "us-south.functions.cloud.ibm.com",
    "x-forwarded-for": "70.122.211.9, 184.172.114.173, 10.74.34.211"
  },
  "__ow_path": ""
}
