<?xml version="1.0" encoding="utf-8"?>
<!DOCTYPE eagle SYSTEM "eagle.dtd">
<eagle version="8.7.1">
<drawing>
<settings>
<setting alwaysvectorfont="no"/>
<setting verticaltext="up"/>
</settings>
<grid distance="0.1" unitdist="inch" unit="inch" style="lines" multiple="1" display="no" altdistance="0.01" altunitdist="inch" altunit="inch"/>
<layers>
<layer number="1" name="Top" color="4" fill="1" visible="no" active="no"/>
<layer number="2" name="Route2" color="1" fill="3" visible="no" active="no"/>
<layer number="3" name="Route3" color="4" fill="3" visible="no" active="no"/>
<layer number="4" name="Route4" color="1" fill="4" visible="no" active="no"/>
<layer number="5" name="Route5" color="4" fill="4" visible="no" active="no"/>
<layer number="6" name="Route6" color="1" fill="8" visible="no" active="no"/>
<layer number="7" name="Route7" color="4" fill="8" visible="no" active="no"/>
<layer number="8" name="Route8" color="1" fill="2" visible="no" active="no"/>
<layer number="9" name="Route9" color="4" fill="2" visible="no" active="no"/>
<layer number="10" name="Route10" color="1" fill="7" visible="no" active="no"/>
<layer number="11" name="Route11" color="4" fill="7" visible="no" active="no"/>
<layer number="12" name="Route12" color="1" fill="5" visible="no" active="no"/>
<layer number="13" name="Route13" color="4" fill="5" visible="no" active="no"/>
<layer number="14" name="Route14" color="1" fill="6" visible="no" active="no"/>
<layer number="15" name="Route15" color="4" fill="6" visible="no" active="no"/>
<layer number="16" name="Bottom" color="1" fill="1" visible="no" active="no"/>
<layer number="17" name="Pads" color="2" fill="1" visible="no" active="no"/>
<layer number="18" name="Vias" color="2" fill="1" visible="no" active="no"/>
<layer number="19" name="Unrouted" color="6" fill="1" visible="no" active="no"/>
<layer number="20" name="Dimension" color="15" fill="1" visible="no" active="no"/>
<layer number="21" name="tPlace" color="58" fill="1" visible="no" active="no"/>
<layer number="22" name="bPlace" color="7" fill="1" visible="no" active="no"/>
<layer number="23" name="tOrigins" color="15" fill="1" visible="no" active="no"/>
<layer number="24" name="bOrigins" color="15" fill="1" visible="no" active="no"/>
<layer number="25" name="tNames" color="57" fill="1" visible="no" active="no"/>
<layer number="26" name="bNames" color="7" fill="1" visible="no" active="no"/>
<layer number="27" name="tValues" color="7" fill="1" visible="no" active="no"/>
<layer number="28" name="bValues" color="7" fill="1" visible="no" active="no"/>
<layer number="29" name="tStop" color="7" fill="3" visible="no" active="no"/>
<layer number="30" name="bStop" color="7" fill="6" visible="no" active="no"/>
<layer number="31" name="tCream" color="7" fill="4" visible="no" active="no"/>
<layer number="32" name="bCream" color="7" fill="5" visible="no" active="no"/>
<layer number="33" name="tFinish" color="6" fill="3" visible="no" active="no"/>
<layer number="34" name="bFinish" color="6" fill="6" visible="no" active="no"/>
<layer number="35" name="tGlue" color="7" fill="4" visible="no" active="no"/>
<layer number="36" name="bGlue" color="7" fill="5" visible="no" active="no"/>
<layer number="37" name="tTest" color="7" fill="1" visible="no" active="no"/>
<layer number="38" name="bTest" color="7" fill="1" visible="no" active="no"/>
<layer number="39" name="tKeepout" color="4" fill="11" visible="no" active="no"/>
<layer number="40" name="bKeepout" color="1" fill="11" visible="no" active="no"/>
<layer number="41" name="tRestrict" color="4" fill="10" visible="no" active="no"/>
<layer number="42" name="bRestrict" color="1" fill="10" visible="no" active="no"/>
<layer number="43" name="vRestrict" color="2" fill="10" visible="no" active="no"/>
<layer number="44" name="Drills" color="7" fill="1" visible="no" active="no"/>
<layer number="45" name="Holes" color="7" fill="1" visible="no" active="no"/>
<layer number="46" name="Milling" color="3" fill="1" visible="no" active="no"/>
<layer number="47" name="Measures" color="7" fill="1" visible="no" active="no"/>
<layer number="48" name="Document" color="7" fill="1" visible="no" active="no"/>
<layer number="49" name="Reference" color="7" fill="1" visible="no" active="no"/>
<layer number="50" name="dxf" color="7" fill="1" visible="no" active="no"/>
<layer number="51" name="tDocu" color="58" fill="1" visible="no" active="no"/>
<layer number="52" name="bDocu" color="7" fill="1" visible="no" active="no"/>
<layer number="53" name="tGND_GNDA" color="7" fill="9" visible="no" active="no"/>
<layer number="54" name="bGND_GNDA" color="1" fill="9" visible="no" active="no"/>
<layer number="56" name="wert" color="7" fill="1" visible="no" active="no"/>
<layer number="57" name="tCAD" color="7" fill="1" visible="no" active="no"/>
<layer number="59" name="tCarbon" color="7" fill="1" visible="no" active="no"/>
<layer number="60" name="bCarbon" color="7" fill="1" visible="no" active="no"/>
<layer number="88" name="SimResults" color="9" fill="1" visible="yes" active="yes"/>
<layer number="89" name="SimProbes" color="9" fill="1" visible="yes" active="yes"/>
<layer number="90" name="Modules" color="5" fill="1" visible="yes" active="yes"/>
<layer number="91" name="Nets" color="2" fill="1" visible="yes" active="yes"/>
<layer number="92" name="Busses" color="1" fill="1" visible="yes" active="yes"/>
<layer number="93" name="Pins" color="2" fill="1" visible="no" active="yes"/>
<layer number="94" name="Symbols" color="4" fill="1" visible="yes" active="yes"/>
<layer number="95" name="Names" color="7" fill="1" visible="yes" active="yes"/>
<layer number="96" name="Values" color="7" fill="1" visible="yes" active="yes"/>
<layer number="97" name="Info" color="7" fill="1" visible="yes" active="yes"/>
<layer number="98" name="Guide" color="6" fill="1" visible="yes" active="yes"/>
<layer number="99" name="SpiceOrder" color="7" fill="1" visible="yes" active="yes"/>
<layer number="100" name="Muster" color="7" fill="1" visible="no" active="no"/>
<layer number="101" name="Patch_Top" color="12" fill="4" visible="yes" active="yes"/>
<layer number="102" name="Vscore" color="7" fill="1" visible="yes" active="yes"/>
<layer number="103" name="tMap" color="7" fill="1" visible="yes" active="yes"/>
<layer number="104" name="Name" color="7" fill="1" visible="yes" active="yes"/>
<layer number="105" name="tPlate" color="7" fill="1" visible="yes" active="yes"/>
<layer number="106" name="bPlate" color="7" fill="1" visible="yes" active="yes"/>
<layer number="107" name="Crop" color="7" fill="1" visible="yes" active="yes"/>
<layer number="108" name="tplace-old" color="10" fill="1" visible="yes" active="yes"/>
<layer number="109" name="ref-old" color="11" fill="1" visible="yes" active="yes"/>
<layer number="110" name="fp0" color="7" fill="1" visible="yes" active="yes"/>
<layer number="111" name="LPC17xx" color="7" fill="1" visible="yes" active="yes"/>
<layer number="112" name="tSilk" color="7" fill="1" visible="yes" active="yes"/>
<layer number="113" name="IDFDebug" color="7" fill="1" visible="yes" active="yes"/>
<layer number="114" name="Badge_Outline" color="7" fill="1" visible="yes" active="yes"/>
<layer number="115" name="ReferenceISLANDS" color="7" fill="1" visible="yes" active="yes"/>
<layer number="116" name="Patch_BOT" color="9" fill="4" visible="yes" active="yes"/>
<layer number="117" name="Drilling" color="63" fill="1" visible="yes" active="yes"/>
<layer number="118" name="Rect_Pads" color="7" fill="1" visible="yes" active="yes"/>
<layer number="121" name="_tsilk" color="7" fill="1" visible="yes" active="yes"/>
<layer number="122" name="_bsilk" color="7" fill="1" visible="yes" active="yes"/>
<layer number="123" name="tTestmark" color="7" fill="1" visible="yes" active="yes"/>
<layer number="124" name="bTestmark" color="7" fill="1" visible="yes" active="yes"/>
<layer number="125" name="_tNames" color="7" fill="1" visible="yes" active="yes"/>
<layer number="126" name="_bNames" color="7" fill="1" visible="yes" active="yes"/>
<layer number="127" name="_tValues" color="7" fill="1" visible="yes" active="yes"/>
<layer number="128" name="_bValues" color="7" fill="1" visible="yes" active="yes"/>
<layer number="129" name="Mask" color="7" fill="1" visible="yes" active="yes"/>
<layer number="131" name="tAdjust" color="7" fill="1" visible="yes" active="yes"/>
<layer number="132" name="bAdjust" color="7" fill="1" visible="yes" active="yes"/>
<layer number="144" name="Drill_legend" color="7" fill="1" visible="yes" active="yes"/>
<layer number="150" name="Notes" color="7" fill="1" visible="yes" active="yes"/>
<layer number="151" name="HeatSink" color="7" fill="1" visible="yes" active="yes"/>
<layer number="152" name="_bDocu" color="7" fill="1" visible="yes" active="yes"/>
<layer number="153" name="FabDoc1" color="7" fill="1" visible="yes" active="yes"/>
<layer number="154" name="FabDoc2" color="7" fill="1" visible="yes" active="yes"/>
<layer number="155" name="FabDoc3" color="7" fill="1" visible="yes" active="yes"/>
<layer number="199" name="Contour" color="7" fill="1" visible="yes" active="yes"/>
<layer number="200" name="200bmp" color="1" fill="10" visible="yes" active="yes"/>
<layer number="201" name="201bmp" color="2" fill="10" visible="yes" active="yes"/>
<layer number="202" name="202bmp" color="3" fill="10" visible="yes" active="yes"/>
<layer number="203" name="203bmp" color="4" fill="10" visible="yes" active="yes"/>
<layer number="204" name="204bmp" color="5" fill="10" visible="yes" active="yes"/>
<layer number="205" name="205bmp" color="6" fill="10" visible="yes" active="yes"/>
<layer number="206" name="206bmp" color="7" fill="10" visible="yes" active="yes"/>
<layer number="207" name="207bmp" color="8" fill="10" visible="yes" active="yes"/>
<layer number="208" name="208bmp" color="9" fill="10" visible="yes" active="yes"/>
<layer number="209" name="209bmp" color="7" fill="1" visible="yes" active="yes"/>
<layer number="210" name="210bmp" color="7" fill="1" visible="yes" active="yes"/>
<layer number="211" name="211bmp" color="7" fill="1" visible="yes" active="yes"/>
<layer number="212" name="212bmp" color="7" fill="1" visible="yes" active="yes"/>
<layer number="213" name="213bmp" color="7" fill="1" visible="yes" active="yes"/>
<layer number="214" name="214bmp" color="7" fill="1" visible="yes" active="yes"/>
<layer number="215" name="215bmp" color="7" fill="1" visible="yes" active="yes"/>
<layer number="216" name="216bmp" color="7" fill="1" visible="yes" active="yes"/>
<layer number="217" name="217bmp" color="18" fill="1" visible="no" active="no"/>
<layer number="218" name="218bmp" color="19" fill="1" visible="no" active="no"/>
<layer number="219" name="219bmp" color="20" fill="1" visible="no" active="no"/>
<layer number="220" name="220bmp" color="21" fill="1" visible="no" active="no"/>
<layer number="221" name="221bmp" color="22" fill="1" visible="no" active="no"/>
<layer number="222" name="222bmp" color="23" fill="1" visible="no" active="no"/>
<layer number="223" name="223bmp" color="24" fill="1" visible="no" active="no"/>
<layer number="224" name="224bmp" color="25" fill="1" visible="no" active="no"/>
<layer number="225" name="225bmp" color="7" fill="1" visible="yes" active="yes"/>
<layer number="226" name="226bmp" color="7" fill="1" visible="yes" active="yes"/>
<layer number="227" name="227bmp" color="7" fill="1" visible="yes" active="yes"/>
<layer number="228" name="228bmp" color="7" fill="1" visible="yes" active="yes"/>
<layer number="229" name="229bmp" color="7" fill="1" visible="yes" active="yes"/>
<layer number="230" name="230bmp" color="7" fill="1" visible="yes" active="yes"/>
<layer number="231" name="231bmp" color="7" fill="1" visible="yes" active="yes"/>
<layer number="232" name="Eagle3D_PG2" color="7" fill="1" visible="yes" active="yes"/>
<layer number="233" name="Eagle3D_PG3" color="7" fill="1" visible="yes" active="yes"/>
<layer number="248" name="Housing" color="7" fill="1" visible="yes" active="yes"/>
<layer number="249" name="Edge" color="7" fill="1" visible="yes" active="yes"/>
<layer number="250" name="Descript" color="3" fill="1" visible="no" active="no"/>
<layer number="251" name="SMDround" color="12" fill="11" visible="no" active="no"/>
<layer number="254" name="cooling" color="7" fill="1" visible="yes" active="yes"/>
<layer number="255" name="routoute" color="7" fill="1" visible="yes" active="yes"/>
</layers>
<schematic xreflabel="%F%N/%S.%C%R" xrefpart="/%S.%C%R">
<libraries>
<library name="fab" urn="urn:adsk.eagle:library:2432493">
<description>&lt;b&gt;Fablab Library&lt;/b&gt;

&lt;p&gt;This library contains many components found on Fablab's inventory.&lt;/p&gt;</description>
<packages>
<package name="PJ-002AH-SMT-TR" urn="urn:adsk.eagle:footprint:2727690/2" library_version="10">
<description>&lt;p&gt;Technical specifications:
&lt;ul&gt;
&lt;li&gt;Rated Input Voltage (typ): 24 V
&lt;li&gt;Rated Input Current (max): 5 A
&lt;li&gt;Operating Temperature: -25 to 85 °C
&lt;/ul&gt;
&lt;p&gt;Digikey code: CP-002AHPJCT-ND
&lt;p&gt;
&lt;a href="https://www.cui.com/product/resource/pj-002ah-smt-tr.pdf"&gt;Datasheet&lt;/a&gt;&lt;/p&gt;</description>
<wire x1="-7.4" y1="4.4" x2="-7.4" y2="-4.5" width="0.127" layer="21"/>
<wire x1="-7.4" y1="-4.5" x2="7.4" y2="-4.5" width="0.127" layer="21"/>
<wire x1="7.4" y1="-4.5" x2="7.4" y2="4.5" width="0.127" layer="21"/>
<wire x1="7.4" y1="4.5" x2="-7.4" y2="4.5" width="0.127" layer="21"/>
<wire x1="2.54" y1="0" x2="-7.62" y2="0" width="0.635" layer="21"/>
<smd name="1@2" x="3.7" y="6" dx="2.8" dy="2.4" layer="1" rot="R270"/>
<smd name="3" x="3.7" y="-6" dx="2.8" dy="2.4" layer="1" rot="R270"/>
<smd name="2" x="-2.4" y="-6" dx="2.8" dy="2.4" layer="1" rot="R270"/>
<smd name="1@1" x="-2.4" y="6" dx="2.8" dy="2.4" layer="1" rot="R270"/>
<text x="-6" y="2" size="1.27" layer="25">&gt;NAME</text>
<rectangle x1="2.75" y1="4.75" x2="4.55" y2="6.25" layer="51" rot="R270"/>
<rectangle x1="2.75" y1="-6.25" x2="4.55" y2="-4.75" layer="51" rot="R270"/>
<rectangle x1="-3.25" y1="-6.25" x2="-1.45" y2="-4.75" layer="51" rot="R270"/>
<rectangle x1="-3.35" y1="4.75" x2="-1.55" y2="6.25" layer="51" rot="R270"/>
<hole x="-2.4" y="0" drill="1.7"/>
<hole x="2.1" y="0" drill="1.8"/>
<circle x="-2.4" y="0" radius="0.425" width="0.85" layer="117"/>
<circle x="2.1" y="0" radius="0.45" width="0.9" layer="117"/>
</package>
<package name="PJ1-023-SMT-TR" urn="urn:adsk.eagle:footprint:2727691/1" library_version="10">
<description>&lt;p&gt;Technical specifications:
&lt;ul&gt;
&lt;li&gt;Rated Input Voltage (typ): 24 V
&lt;li&gt;Rated Input Current (max): 2.5 A
&lt;li&gt;Operating Temperature: -25 to 85 °C
&lt;/ul&gt;
&lt;p&gt;Digikey code: CP1-023PJCT-ND
&lt;p&gt;
&lt;a href="https://www.cui.com/product/resource/pj1-023-smt-tr.pdf"&gt;Datasheet&lt;/a&gt;&lt;/p&gt;</description>
<wire x1="0" y1="-2.5" x2="0" y2="0" width="0.127" layer="21"/>
<wire x1="0" y1="0" x2="0" y2="2.5" width="0.127" layer="21"/>
<wire x1="0" y1="2.5" x2="2" y2="2.5" width="0.127" layer="21"/>
<wire x1="2" y1="2.5" x2="2" y2="2.8" width="0.127" layer="21"/>
<wire x1="2" y1="2.8" x2="6" y2="2.8" width="0.127" layer="21"/>
<wire x1="6" y1="2.8" x2="6" y2="2.5" width="0.127" layer="21"/>
<wire x1="6" y1="2.5" x2="11" y2="2.5" width="0.127" layer="21"/>
<wire x1="11" y1="2.5" x2="11" y2="-2.5" width="0.127" layer="21"/>
<wire x1="0" y1="-2.5" x2="2" y2="-2.5" width="0.127" layer="21"/>
<wire x1="2" y1="-2.5" x2="2" y2="-2.8" width="0.127" layer="21"/>
<wire x1="2" y1="-2.8" x2="6" y2="-2.8" width="0.127" layer="21"/>
<wire x1="6" y1="-2.8" x2="6" y2="-2.5" width="0.127" layer="21"/>
<wire x1="6" y1="-2.5" x2="11" y2="-2.5" width="0.127" layer="21"/>
<wire x1="0" y1="0" x2="8.6" y2="0" width="0.6" layer="21"/>
<smd name="SHIELD@1" x="3.5" y="3.5" dx="3.5" dy="1.5" layer="1"/>
<smd name="SHIELD@2" x="4.5" y="-3.5" dx="3.5" dy="1.5" layer="1"/>
<smd name="PIN3" x="10" y="3.65" dx="3.5" dy="2.3" layer="1"/>
<smd name="PIN2" x="9" y="-3.65" dx="3.5" dy="2.3" layer="1"/>
<smd name="PIN1" x="12" y="0" dx="2" dy="2.5" layer="1"/>
<hole x="3" y="0" drill="1.6"/>
<hole x="8.5" y="0" drill="1.6"/>
<circle x="3" y="0" radius="0.4" width="0.8" layer="117"/>
<circle x="8.5" y="0" radius="0.4" width="0.8" layer="117"/>
<rectangle x1="2.5" y1="2.8" x2="4.5" y2="3.55" layer="51"/>
<rectangle x1="3.5" y1="-3.55" x2="5.5" y2="-2.8" layer="51"/>
<rectangle x1="9" y1="2.5" x2="11" y2="4.1" layer="51"/>
<rectangle x1="8" y1="-4.1" x2="10" y2="-2.5" layer="51"/>
<rectangle x1="11" y1="-0.5" x2="12.5" y2="0.5" layer="51"/>
<text x="0" y="5.08" size="1.27" layer="25">&gt;NAME</text>
</package>
<package name="3.5MMTERM" urn="urn:adsk.eagle:footprint:2432595/1" library_version="10">
<wire x1="-3.4" y1="3.4" x2="-3.4" y2="-2.2" width="0.127" layer="21"/>
<wire x1="-3.4" y1="-2.2" x2="-3.4" y2="-3.6" width="0.127" layer="21"/>
<wire x1="-3.4" y1="-3.6" x2="3.6" y2="-3.6" width="0.127" layer="21"/>
<wire x1="3.6" y1="-3.6" x2="3.6" y2="-2.2" width="0.127" layer="21"/>
<wire x1="3.6" y1="-2.2" x2="3.6" y2="3.4" width="0.127" layer="21"/>
<wire x1="3.6" y1="3.4" x2="-3.4" y2="3.4" width="0.127" layer="21"/>
<wire x1="-3.4" y1="-2.2" x2="3.6" y2="-2.2" width="0.127" layer="21"/>
<pad name="1" x="1.8" y="0" drill="1" diameter="2.1844"/>
<pad name="2" x="-1.7" y="0" drill="1" diameter="2.1844"/>
<text x="3" y="5" size="1.27" layer="25" rot="R180">&gt;NAME</text>
</package>
<package name="ED555DS-2DS" urn="urn:adsk.eagle:footprint:2432596/1" library_version="10">
<wire x1="-3.4" y1="3.4" x2="-3.4" y2="-2.2" width="0.127" layer="21"/>
<wire x1="-3.4" y1="-2.2" x2="-3.4" y2="-3.6" width="0.127" layer="21"/>
<wire x1="-3.4" y1="-3.6" x2="3.6" y2="-3.6" width="0.127" layer="21"/>
<wire x1="3.6" y1="-3.6" x2="3.6" y2="-2.2" width="0.127" layer="21"/>
<wire x1="3.6" y1="-2.2" x2="3.6" y2="3.4" width="0.127" layer="21"/>
<wire x1="3.6" y1="3.4" x2="-3.4" y2="3.4" width="0.127" layer="21"/>
<wire x1="-3.4" y1="-2.2" x2="3.6" y2="-2.2" width="0.127" layer="21"/>
<pad name="1" x="1.8" y="0" drill="1.2" diameter="2.1844"/>
<pad name="2" x="-1.7" y="0" drill="1.2" diameter="2.1844"/>
<text x="3" y="5" size="1.27" layer="25" rot="R180">&gt;NAME</text>
</package>
<package name="ED555DS-2DS-DRILL" urn="urn:adsk.eagle:footprint:2593471/2" library_version="10">
<wire x1="-3.4" y1="3.4" x2="-3.4" y2="-2.2" width="0.127" layer="21"/>
<wire x1="-3.4" y1="-2.2" x2="-3.4" y2="-3.6" width="0.127" layer="21"/>
<wire x1="-3.4" y1="-3.6" x2="3.6" y2="-3.6" width="0.127" layer="21"/>
<wire x1="3.6" y1="-3.6" x2="3.6" y2="-2.2" width="0.127" layer="21"/>
<wire x1="3.6" y1="-2.2" x2="3.6" y2="3.4" width="0.127" layer="21"/>
<wire x1="3.6" y1="3.4" x2="-3.4" y2="3.4" width="0.127" layer="21"/>
<wire x1="-3.4" y1="-2.2" x2="3.6" y2="-2.2" width="0.127" layer="21"/>
<pad name="1" x="1.8" y="0" drill="1.016" diameter="2.54"/>
<pad name="2" x="-1.7" y="0" drill="1.016" diameter="2.54"/>
<text x="3" y="5" size="1.27" layer="25" rot="R180">&gt;NAME</text>
<circle x="1.8" y="0" radius="0.254" width="0.508" layer="117"/>
<circle x="-1.7" y="0" radius="0.254" width="0.508" layer="117"/>
</package>
</packages>
<packages3d>
<package3d name="PJ-002AH-SMT-TR" urn="urn:adsk.eagle:package:2727695/2" type="box" library_version="10">
<description>&lt;p&gt;Technical specifications:
&lt;ul&gt;
&lt;li&gt;Rated Input Voltage (typ): 24 V
&lt;li&gt;Rated Input Current (max): 5 A
&lt;li&gt;Operating Temperature: -25 to 85 °C
&lt;/ul&gt;
&lt;p&gt;Digikey code: CP-002AHPJCT-ND
&lt;p&gt;
&lt;a href="https://www.cui.com/product/resource/pj-002ah-smt-tr.pdf"&gt;Datasheet&lt;/a&gt;&lt;/p&gt;</description>
<packageinstances>
<packageinstance name="PJ-002AH-SMT-TR"/>
</packageinstances>
</package3d>
<package3d name="PJ1-023-SMT-TR" urn="urn:adsk.eagle:package:2727696/1" type="box" library_version="10">
<description>&lt;p&gt;Technical specifications:
&lt;ul&gt;
&lt;li&gt;Rated Input Voltage (typ): 24 V
&lt;li&gt;Rated Input Current (max): 2.5 A
&lt;li&gt;Operating Temperature: -25 to 85 °C
&lt;/ul&gt;
&lt;p&gt;Digikey code: CP1-023PJCT-ND
&lt;p&gt;
&lt;a href="https://www.cui.com/product/resource/pj1-023-smt-tr.pdf"&gt;Datasheet&lt;/a&gt;&lt;/p&gt;</description>
<packageinstances>
<packageinstance name="PJ1-023-SMT-TR"/>
</packageinstances>
</package3d>
<package3d name="3.5MMTERM" urn="urn:adsk.eagle:package:2432654/1" type="box" library_version="10">
<packageinstances>
<packageinstance name="3.5MMTERM"/>
</packageinstances>
</package3d>
<package3d name="ED555DS-2DS" urn="urn:adsk.eagle:package:2432655/1" type="box" library_version="10">
<packageinstances>
<packageinstance name="ED555DS-2DS"/>
</packageinstances>
</package3d>
<package3d name="ED555DS-2DS-DRILL" urn="urn:adsk.eagle:package:2593473/2" type="box" library_version="10">
<packageinstances>
<packageinstance name="ED555DS-2DS-DRILL"/>
</packageinstances>
</package3d>
</packages3d>
<symbols>
<symbol name="DC_POWER_JACK" urn="urn:adsk.eagle:symbol:2727688/2" library_version="10">
<description>DC power jack</description>
<wire x1="-10.668" y1="3.556" x2="-5.08" y2="3.556" width="0.1524" layer="94"/>
<wire x1="-5.08" y1="4.826" x2="-5.08" y2="8.382" width="0.1524" layer="94"/>
<wire x1="-5.08" y1="8.382" x2="-6.858" y2="8.382" width="0.1524" layer="94"/>
<wire x1="-6.858" y1="8.382" x2="-6.858" y2="7.874" width="0.1524" layer="94"/>
<wire x1="-6.858" y1="7.874" x2="-6.858" y2="5.334" width="0.1524" layer="94"/>
<wire x1="-6.858" y1="5.334" x2="-6.858" y2="4.826" width="0.1524" layer="94"/>
<wire x1="-6.858" y1="4.826" x2="-5.08" y2="4.826" width="0.1524" layer="94"/>
<wire x1="-6.858" y1="5.334" x2="-19.812" y2="5.334" width="0.1524" layer="94"/>
<wire x1="-19.812" y1="7.874" x2="-6.858" y2="7.874" width="0.1524" layer="94"/>
<wire x1="-19.812" y1="5.334" x2="-19.812" y2="7.874" width="0.1524" layer="94" curve="-180"/>
<wire x1="-10.668" y1="3.556" x2="-10.668" y2="2.794" width="0.1524" layer="94"/>
<wire x1="-11.176" y1="2.794" x2="-10.16" y2="2.794" width="0.1524" layer="94"/>
<wire x1="-10.16" y1="2.794" x2="-10.668" y2="0" width="0.1524" layer="94"/>
<wire x1="-10.668" y1="0" x2="-11.176" y2="2.794" width="0.1524" layer="94"/>
<wire x1="-5.08" y1="0" x2="-13.462" y2="0" width="0.1524" layer="94"/>
<wire x1="-13.462" y1="0" x2="-15.24" y2="2.286" width="0.1524" layer="94"/>
<wire x1="-15.24" y1="2.286" x2="-17.018" y2="0" width="0.1524" layer="94"/>
<pin name="PIN1" x="0" y="6.604" visible="pin" length="middle" direction="sup" rot="R180"/>
<pin name="PIN3" x="0" y="3.556" visible="pin" length="middle" direction="pas" rot="R180"/>
<pin name="PIN2" x="0" y="0" visible="pin" length="middle" direction="sup" rot="R180"/>
<text x="-20.32" y="8.382" size="1.27" layer="104">&gt;NAME</text>
</symbol>
<symbol name="1X2" urn="urn:adsk.eagle:symbol:2432537/1" library_version="10">
<wire x1="-2.54" y1="5.08" x2="-2.54" y2="-2.54" width="0.254" layer="94"/>
<wire x1="-2.54" y1="-2.54" x2="5.08" y2="-2.54" width="0.254" layer="94"/>
<wire x1="5.08" y1="-2.54" x2="5.08" y2="5.08" width="0.254" layer="94"/>
<wire x1="5.08" y1="5.08" x2="-2.54" y2="5.08" width="0.254" layer="94"/>
<text x="-2.54" y="5.715" size="1.778" layer="95">&gt;Name</text>
<text x="0" y="4.445" size="1.4224" layer="97" ratio="9" rot="R180">1</text>
<text x="0" y="1.905" size="1.4224" layer="97" ratio="9" rot="R180">2</text>
<pin name="1" x="0" y="2.54" visible="off" length="short" direction="pas" function="dot"/>
<pin name="2" x="0" y="0" visible="off" length="short" direction="pas" function="dot"/>
</symbol>
</symbols>
<devicesets>
<deviceset name="JACK_POWER" urn="urn:adsk.eagle:component:2727701/2" prefix="J" library_version="10">
<description>&lt;b&gt;DC Power Jack&lt;/b&gt;

&lt;p&gt;Manufacturer: CUI Inc.</description>
<gates>
<gate name="G$1" symbol="DC_POWER_JACK" x="0" y="0"/>
</gates>
<devices>
<device name="_2X5.5MM" package="PJ-002AH-SMT-TR">
<connects>
<connect gate="G$1" pin="PIN1" pad="1@1 1@2" route="any"/>
<connect gate="G$1" pin="PIN2" pad="2"/>
<connect gate="G$1" pin="PIN3" pad="3"/>
</connects>
<package3dinstances>
<package3dinstance package3d_urn="urn:adsk.eagle:package:2727695/2"/>
</package3dinstances>
<technologies>
<technology name=""/>
</technologies>
</device>
<device name="_0.7X2.35MM" package="PJ1-023-SMT-TR">
<connects>
<connect gate="G$1" pin="PIN1" pad="PIN1"/>
<connect gate="G$1" pin="PIN2" pad="PIN2"/>
<connect gate="G$1" pin="PIN3" pad="PIN3"/>
</connects>
<package3dinstances>
<package3dinstance package3d_urn="urn:adsk.eagle:package:2727696/1"/>
</package3dinstances>
<technologies>
<technology name=""/>
</technologies>
</device>
</devices>
</deviceset>
<deviceset name="TERMINAL_BLOCK_1X02" urn="urn:adsk.eagle:component:2432703/4" prefix="J" library_version="10">
<description>3.5mm terminal block, 2 positions ED555-2DS as found in the fablab inventory.
Holes for drilling can be exported as image. 
&lt;p&gt;Stolen from &lt;a href="http://www.ladyada.net/library/pcb/eaglelibrary.html"&gt;Adafruit&lt;/a&gt;, adapted by Zaerc.</description>
<gates>
<gate name="G$1" symbol="1X2" x="0" y="0"/>
</gates>
<devices>
<device name="-ADAFRUIT" package="3.5MMTERM">
<connects>
<connect gate="G$1" pin="1" pad="1"/>
<connect gate="G$1" pin="2" pad="2"/>
</connects>
<package3dinstances>
<package3dinstance package3d_urn="urn:adsk.eagle:package:2432654/1"/>
</package3dinstances>
<technologies>
<technology name=""/>
</technologies>
</device>
<device name="-FABLAB" package="ED555DS-2DS">
<connects>
<connect gate="G$1" pin="1" pad="1"/>
<connect gate="G$1" pin="2" pad="2"/>
</connects>
<package3dinstances>
<package3dinstance package3d_urn="urn:adsk.eagle:package:2432655/1"/>
</package3dinstances>
<technologies>
<technology name=""/>
</technologies>
</device>
<device name="-FABLAB-WITH-DRILL-HOLES" package="ED555DS-2DS-DRILL">
<connects>
<connect gate="G$1" pin="1" pad="1"/>
<connect gate="G$1" pin="2" pad="2"/>
</connects>
<package3dinstances>
<package3dinstance package3d_urn="urn:adsk.eagle:package:2593473/2"/>
</package3dinstances>
<technologies>
<technology name=""/>
</technologies>
</device>
</devices>
</deviceset>
</devicesets>
</library>
<library name="supply1" urn="urn:adsk.eagle:library:371">
<description>&lt;b&gt;Supply Symbols&lt;/b&gt;&lt;p&gt;
 GND, VCC, 0V, +5V, -5V, etc.&lt;p&gt;
 Please keep in mind, that these devices are necessary for the
 automatic wiring of the supply signals.&lt;p&gt;
 The pin name defined in the symbol is identical to the net which is to be wired automatically.&lt;p&gt;
 In this library the device names are the same as the pin names of the symbols, therefore the correct signal names appear next to the supply symbols in the schematic.&lt;p&gt;
 &lt;author&gt;Created by librarian@cadsoft.de&lt;/author&gt;</description>
<packages>
</packages>
<symbols>
<symbol name="GND" urn="urn:adsk.eagle:symbol:26925/1" library_version="1">
<wire x1="-1.905" y1="0" x2="1.905" y2="0" width="0.254" layer="94"/>
<text x="-2.54" y="-2.54" size="1.778" layer="96">&gt;VALUE</text>
<pin name="GND" x="0" y="2.54" visible="off" length="short" direction="sup" rot="R270"/>
</symbol>
</symbols>
<devicesets>
<deviceset name="GND" urn="urn:adsk.eagle:component:26954/1" prefix="GND" library_version="1">
<description>&lt;b&gt;SUPPLY SYMBOL&lt;/b&gt;</description>
<gates>
<gate name="1" symbol="GND" x="0" y="0"/>
</gates>
<devices>
<device name="">
<technologies>
<technology name=""/>
</technologies>
</device>
</devices>
</deviceset>
</devicesets>
</library>
</libraries>
<attributes>
</attributes>
<variantdefs>
</variantdefs>
<classes>
<class number="0" name="default" width="0" drill="0">
</class>
</classes>
<parts>
<part name="J1" library="fab" library_urn="urn:adsk.eagle:library:2432493" deviceset="JACK_POWER" device="_2X5.5MM" package3d_urn="urn:adsk.eagle:package:2727695/2"/>
<part name="J2" library="fab" library_urn="urn:adsk.eagle:library:2432493" deviceset="TERMINAL_BLOCK_1X02" device="-FABLAB-WITH-DRILL-HOLES" package3d_urn="urn:adsk.eagle:package:2593473/2"/>
<part name="GND1" library="supply1" library_urn="urn:adsk.eagle:library:371" deviceset="GND" device=""/>
</parts>
<sheets>
<sheet>
<plain>
</plain>
<instances>
<instance part="J1" gate="G$1" x="22.86" y="15.24"/>
<instance part="J2" gate="G$1" x="38.1" y="17.78"/>
<instance part="GND1" gate="1" x="30.48" y="7.62"/>
</instances>
<busses>
</busses>
<nets>
<net name="PIN1" class="0">
<segment>
<pinref part="J1" gate="G$1" pin="PIN1"/>
<wire x1="22.86" y1="21.844" x2="33.02" y2="21.844" width="0.1524" layer="91"/>
<wire x1="33.02" y1="21.844" x2="33.02" y2="20.32" width="0.1524" layer="91"/>
<pinref part="J2" gate="G$1" pin="1"/>
<wire x1="33.02" y1="20.32" x2="38.1" y2="20.32" width="0.1524" layer="91"/>
</segment>
</net>
<net name="GND" class="0">
<segment>
<pinref part="J1" gate="G$1" pin="PIN2"/>
<wire x1="22.86" y1="15.24" x2="30.48" y2="15.24" width="0.1524" layer="91"/>
<pinref part="J2" gate="G$1" pin="2"/>
<wire x1="30.48" y1="15.24" x2="30.48" y2="17.78" width="0.1524" layer="91"/>
<wire x1="30.48" y1="17.78" x2="38.1" y2="17.78" width="0.1524" layer="91"/>
<pinref part="J1" gate="G$1" pin="PIN3"/>
<wire x1="22.86" y1="18.796" x2="30.48" y2="18.796" width="0.1524" layer="91"/>
<wire x1="30.48" y1="18.796" x2="30.48" y2="17.78" width="0.1524" layer="91"/>
<junction x="30.48" y="17.78"/>
<pinref part="GND1" gate="1" pin="GND"/>
<wire x1="30.48" y1="10.16" x2="30.48" y2="15.24" width="0.1524" layer="91"/>
<junction x="30.48" y="15.24"/>
</segment>
</net>
</nets>
</sheet>
</sheets>
</schematic>
</drawing>
<compatibility>
<note version="8.2" severity="warning">
Since Version 8.2, EAGLE supports online libraries. The ids
of those online libraries will not be understood (or retained)
with this version.
</note>
<note version="8.3" severity="warning">
Since Version 8.3, EAGLE supports URNs for individual library
assets (packages, symbols, and devices). The URNs of those assets
will not be understood (or retained) with this version.
</note>
<note version="8.3" severity="warning">
Since Version 8.3, EAGLE supports the association of 3D packages
with devices in libraries, schematics, and board files. Those 3D
packages will not be understood (or retained) with this version.
</note>
</compatibility>
</eagle>
