<?xml version="1.0" encoding="UTF-8" standalone="no"?>
<svg
   xmlns:dc="http://purl.org/dc/elements/1.1/"
   xmlns:cc="http://creativecommons.org/ns#"
   xmlns:rdf="http://www.w3.org/1999/02/22-rdf-syntax-ns#"
   xmlns:svg="http://www.w3.org/2000/svg"
   xmlns="http://www.w3.org/2000/svg"
   xmlns:xlink="http://www.w3.org/1999/xlink"
   id="svg8"
   version="1.1"
   viewBox="0 0 84.476494 84.476494"
   height="84.476494mm"
   width="84.476494mm">
  <defs
     id="defs2">
    <linearGradient
       id="linearGradient5251">
      <stop
         id="stop5247"
         offset="0"
         style="stop-color:#ffffff;stop-opacity:1;" />
      <stop
         id="stop5249"
         offset="1"
         style="stop-color:#ffffff;stop-opacity:0;" />
    </linearGradient>
    <radialGradient
       gradientTransform="matrix(0.87702562,0.89107232,-0.89525478,0.88114219,113.74601,-68.366946)"
       gradientUnits="userSpaceOnUse"
       r="40.125381"
       fy="115.47694"
       fx="90.430794"
       cy="115.47694"
       cx="90.430794"
       id="radialGradient5257"
       xlink:href="#linearGradient5251" />
  </defs>
  <metadata
     id="metadata5">
    <rdf:RDF>
      <cc:Work
         rdf:about="">
        <dc:format>image/svg+xml</dc:format>
        <dc:type
           rdf:resource="http://purl.org/dc/dcmitype/StillImage" />
        <dc:title></dc:title>
      </cc:Work>
    </rdf:RDF>
  </metadata>
  <g
     transform="translate(-56.896785,-82.506591)"
     id="layer1">
    <ellipse
       ry="38.837059"
       rx="40.159969"
       cy="123.60342"
       cx="98.746277"
       id="COLORIZE1_1"
       style="display:inline;fill:#ff0000;fill-opacity:1;stroke-width:0.22100864" />
    <circle
       r="39.558262"
       cy="124.83184"
       cx="99.502235"
       id="path6419"
       style="display:inline;opacity:0.8;fill:#000000;fill-opacity:0.6;stroke-width:0.26458332" />
    <circle
       r="40.125381"
       cy="123.41444"
       cx="98.368301"
       id="path4650"
       style="display:inline;opacity:0.7;fill:url(#radialGradient5257);fill-opacity:1;stroke-width:0.26458332" />
    <path
       id="path4643"
       transform="scale(0.26458333)"
       d="M 374.68359,311.83594 A 159.64065,159.64065 0 0 0 215.04297,471.47656 159.64065,159.64065 0 0 0 374.68359,631.11719 159.64065,159.64065 0 0 0 534.32422,471.47656 159.64065,159.64065 0 0 0 374.68359,311.83594 Z m 0,19.66015 A 139.98109,139.98109 0 0 1 514.66602,471.47656 139.98109,139.98109 0 0 1 374.68359,611.45703 139.98109,139.98109 0 0 1 234.70312,471.47656 139.98109,139.98109 0 0 1 374.68359,331.49609 Z"
       style="display:inline;fill:#cccccc;fill-opacity:1;stroke-width:0.92355269" />
  </g>
</svg>
