<?xml version="1.0" encoding="UTF-8" standalone="no"?>
<!-- Created with Inkscape (http://www.inkscape.org/) -->

<svg
   xmlns:dc="http://purl.org/dc/elements/1.1/"
   xmlns:cc="http://creativecommons.org/ns#"
   xmlns:rdf="http://www.w3.org/1999/02/22-rdf-syntax-ns#"
   xmlns:svg="http://www.w3.org/2000/svg"
   xmlns="http://www.w3.org/2000/svg"
   version="1.1"
   width="428.409"
   height="345.862"
   id="svg3118">
  <defs
     id="defs3120" />
  <metadata
     id="metadata3123">
    <rdf:RDF>
      <cc:Work
         rdf:about="">
        <dc:format>image/svg+xml</dc:format>
        <dc:type
           rdf:resource="http://purl.org/dc/dcmitype/StillImage" />
        <dc:title></dc:title>
      </cc:Work>
    </rdf:RDF>
  </metadata>
  <g
     transform="translate(-135.7955,-359.43118)"
     id="layer1">
    <rect
       width="428.40799"
       height="345.86099"
       x="135.7955"
       y="359.43118"
       id="rect3209"
       style="fill:#001717;fill-opacity:1" />
    <path
       d="m 360.4485,705.29318 h -224.653 v -87.771 c 17.763,-5.224 37.616,-7.314 57.469,-7.314 25.078,0 50.155,4.18 71.053,12.539 6.269,2.09 11.494,4.18 16.718,7.314 36.573,16.717 64.785,42.84 79.413,75.232 z"
       id="path3211"
       style="fill:#334a5e" />
    <path
       d="m 564.2045,594.53318 v 110.759 h -337.502 c 9.404,-29.257 29.257,-55.38 55.38,-76.278 42.841,-34.482 103.445,-55.38 172.408,-55.38 38.661,0.002 77.322,7.316 109.714,20.899 z"
       id="path3213"
       style="fill:#40596b" />
    <g
       transform="matrix(0.99999999,0,0.0143818,0.99999999,97.601529,322.86018)"
       id="g3215">
      <circle
         cx="122.253"
         cy="122.253"
         r="42.841"
         id="circle3217"
         style="fill:#ffffd2;fill-opacity:1" />
      <path
         d="m 433.633,101.355 c 1.045,-3.135 1.045,-6.269 1.045,-9.404 0,-16.718 -13.584,-31.347 -31.347,-31.347 -11.494,0 -21.943,6.269 -27.167,15.673 -3.135,-2.09 -7.314,-2.09 -11.494,-2.09 -14.629,0 -26.122,10.449 -28.212,24.033 -8.359,2.09 -14.629,9.404 -14.629,17.763 0,10.449 8.359,18.808 18.808,18.808 h 82.547 c 10.449,0 18.808,-8.359 18.808,-18.808 0,-6.269 -3.135,-11.493 -8.359,-14.628 z"
         id="path3219"
         style="fill:#005657;fill-opacity:1" />
    </g>
    <g
       transform="translate(99.224501,322.86018)"
       id="g3221" />
    <g
       transform="translate(99.224501,322.86018)"
       id="g3223" />
    <g
       transform="translate(99.224501,322.86018)"
       id="g3225" />
    <g
       transform="translate(99.224501,322.86018)"
       id="g3227" />
    <g
       transform="translate(99.224501,322.86018)"
       id="g3229" />
    <g
       transform="translate(99.224501,322.86018)"
       id="g3231" />
    <g
       transform="translate(99.224501,322.86018)"
       id="g3233" />
    <g
       transform="translate(99.224501,322.86018)"
       id="g3235" />
    <g
       transform="translate(99.224501,322.86018)"
       id="g3237" />
    <g
       transform="translate(99.224501,322.86018)"
       id="g3239" />
    <g
       transform="translate(99.224501,322.86018)"
       id="g3241" />
    <g
       transform="translate(99.224501,322.86018)"
       id="g3243" />
    <g
       transform="translate(99.224501,322.86018)"
       id="g3245" />
    <g
       transform="translate(99.224501,322.86018)"
       id="g3247" />
    <g
       transform="translate(99.224501,322.86018)"
       id="g3249" />
  </g>
</svg>
