<?xml version="1.0" encoding="UTF-8" standalone="no"?>
<svg
   xmlns:dc="http://purl.org/dc/elements/1.1/"
   xmlns:cc="http://creativecommons.org/ns#"
   xmlns:rdf="http://www.w3.org/1999/02/22-rdf-syntax-ns#"
   xmlns:svg="http://www.w3.org/2000/svg"
   xmlns="http://www.w3.org/2000/svg"
   id="svg8"
   version="1.1"
   viewBox="0 0 84.476494 84.476494"
   height="84.476494mm"
   width="84.476494mm">
  <defs
     id="defs2" />
  <metadata
     id="metadata5">
    <rdf:RDF>
      <cc:Work
         rdf:about="">
        <dc:format>image/svg+xml</dc:format>
        <dc:type
           rdf:resource="http://purl.org/dc/dcmitype/StillImage" />
        <dc:title></dc:title>
      </cc:Work>
    </rdf:RDF>
  </metadata>
  <g
     transform="translate(-56.896785,-82.506591)"
     id="layer1">
    <path
       id="path4643"
       transform="scale(0.26458333)"
       d="M 374.68359,311.83594 A 159.64065,159.64065 0 0 0 215.04297,471.47656 159.64065,159.64065 0 0 0 374.68359,631.11719 159.64065,159.64065 0 0 0 534.32422,471.47656 159.64065,159.64065 0 0 0 374.68359,311.83594 Z m 0,19.66015 A 139.98109,139.98109 0 0 1 514.66602,471.47656 139.98109,139.98109 0 0 1 374.68359,611.45703 139.98109,139.98109 0 0 1 234.70312,471.47656 139.98109,139.98109 0 0 1 374.68359,331.49609 Z"
       style="display:inline;fill:#cccccc;fill-opacity:1;stroke-width:0.92355269" />
    <circle
       r="37.230656"
       cy="124.74484"
       cx="99.135033"
       id="COLORIZE1_1"
       style="opacity:1;fill:#ffffff;fill-opacity:1;stroke-width:0.26697904" />
    <circle
       r="34.4422"
       cy="124.74484"
       cx="99.135033"
       id="path6417"
       style="opacity:1;fill:#333333;fill-opacity:1;stroke-width:0.2820957" />
    <circle
       r="33.229412"
       cy="124.74484"
       cx="99.135033"
       id="path6417-0"
       style="opacity:1;fill:#999999;fill-opacity:1;stroke-width:0.2721625" />
    <circle
       r="32.142731"
       cy="124.74484"
       cx="99.135033"
       id="path6417-0-0"
       style="opacity:1;fill:#cccccc;fill-opacity:1;stroke-width:0.26326209" />
    <circle
       r="31.197788"
       cy="124.74484"
       cx="99.135033"
       id="path6417-0-0-5"
       style="opacity:1;fill:#f2f2f2;fill-opacity:1;stroke-width:0.25552264" />
    <g
       style="display:inline;fill:none"
       transform="matrix(0.35277777,0,0,0.35277777,139.05869,55.548081)"
       id="surface1">
      <g
         style="fill:none"
         id="layer1-3"
         transform="matrix(0.75000002,0,0,0.75000002,-180.89577,-243.33043)">
        <path
           style="fill:none;fill-opacity:1;fill-rule:nonzero;stroke:#ff0000;stroke-width:9.44881916;stroke-linecap:round;stroke-linejoin:miter;stroke-miterlimit:4;stroke-dasharray:none;stroke-opacity:1"
           id="COLORIZE2_2"
           d="m -401.32842,344.52538 a 68.426384,68.377068 0 0 1 -38.36848,82.9467 68.426384,68.377068 0 0 1 -86.63583,-29.2442 68.426384,68.377068 0 0 1 19.82597,-89.20578 68.426384,68.377068 0 0 1 90.87915,10.15164"
           transform="matrix(0.48845944,-0.8725866,0.87281878,0.48804445,0,0)" />
        <path
           style="fill:none;fill-rule:evenodd;stroke:#ff0000;stroke-width:9.44881916;stroke-linecap:round;stroke-linejoin:miter;stroke-miterlimit:4;stroke-dasharray:none;stroke-opacity:1"
           d="m 90.301941,492.59693 v 49.44805"
           id="COLORIZE2_1" />
      </g>
    </g>
  </g>
</svg>
