<?xml version="1.0" encoding="UTF-8" standalone="no"?>
<!-- Created with Inkscape (http://www.inkscape.org/) -->

<svg
   xmlns:dc="http://purl.org/dc/elements/1.1/"
   xmlns:cc="http://creativecommons.org/ns#"
   xmlns:rdf="http://www.w3.org/1999/02/22-rdf-syntax-ns#"
   xmlns:svg="http://www.w3.org/2000/svg"
   xmlns="http://www.w3.org/2000/svg"
   version="1.1"
   width="84.476494mm"
   height="84.476494mm"
   viewBox="0 0 84.476494 84.476494"
   id="svg8">
  <defs
     id="defs2" />
  <metadata
     id="metadata5">
    <rdf:RDF>
      <cc:Work
         rdf:about="">
        <dc:format>image/svg+xml</dc:format>
        <dc:type
           rdf:resource="http://purl.org/dc/dcmitype/StillImage" />
        <dc:title></dc:title>
      </cc:Work>
    </rdf:RDF>
  </metadata>
  <g
     transform="translate(-56.896785,-82.506591)"
     id="layer1">
    <path
       d="M 374.68359,311.83594 A 159.64065,159.64065 0 0 0 215.04297,471.47656 159.64065,159.64065 0 0 0 374.68359,631.11719 159.64065,159.64065 0 0 0 534.32422,471.47656 159.64065,159.64065 0 0 0 374.68359,311.83594 z m 0,19.66015 A 139.98109,139.98109 0 0 1 514.66602,471.47656 139.98109,139.98109 0 0 1 374.68359,611.45703 139.98109,139.98109 0 0 1 234.70312,471.47656 139.98109,139.98109 0 0 1 374.68359,331.49609 z"
       transform="scale(0.26458333,0.26458333)"
       id="path4643"
       style="fill:#666666;fill-opacity:1;stroke-width:0.92355269;display:inline" />
    <circle
       cx="99.135033"
       cy="124.74484"
       r="37.230656"
       id="COLORIZE1_1"
       style="opacity:0.8;fill:#ffffff;fill-opacity:1;stroke-width:0.26697904" />
    <circle
       cx="99.135033"
       cy="124.74484"
       r="34.4422"
       id="path6417"
       style="fill:#666666;fill-opacity:1;stroke-width:0.2820957" />
    <circle
       cx="99.135033"
       cy="124.74484"
       r="33.229412"
       id="path6417-0"
       style="fill:#555555;fill-opacity:1;stroke-width:0.2721625" />
    <circle
       cx="99.135033"
       cy="124.74484"
       r="32.142731"
       id="path6417-0-0"
       style="fill:#444444;fill-opacity:1;stroke-width:0.26326209" />
    <circle
       cx="99.135033"
       cy="124.74484"
       r="31.197788"
       id="path6417-0-0-5"
       style="fill:#888888;fill-opacity:1;stroke-width:0.25552264;display:inline" />
    <g
       transform="matrix(0.35277777,0,0,0.35277777,139.05869,55.548081)"
       id="surface1"
       style="fill:none;display:inline">
      <g
         transform="matrix(0.75000002,0,0,0.75000002,-180.89577,-243.33043)"
         id="layer1-3"
         style="fill:none;display:inline">
        <g
           transform="translate(1.4287652,14.368653)"
           id="g5242"
           style="fill:none">
          <path
             d="m -389.48449,336.26015 a 68.426384,68.377068 0 1 1 -14.29919,-25.35163"
             transform="matrix(0.48845944,-0.8725866,0.87281878,0.48804445,0,0)"
             id="COLORIZE2_2"
             style="fill:none;stroke:#ff0000;stroke-width:9.44881916;stroke-linecap:round;stroke-linejoin:miter;stroke-miterlimit:4;stroke-opacity:1;stroke-dasharray:none" />
          <path
             d="m 88.873176,478.22828 v 49.44805"
             id="COLORIZE2_1"
             style="fill:none;stroke:#ff0000;stroke-width:9.44881916;stroke-linecap:round;stroke-linejoin:miter;stroke-miterlimit:4;stroke-opacity:1;stroke-dasharray:none" />
        </g>
      </g>
    </g>
  </g>
</svg>
