<?xml version="1.0" encoding="UTF-8" standalone="no"?>
<svg
   xmlns:dc="http://purl.org/dc/elements/1.1/"
   xmlns:cc="http://creativecommons.org/ns#"
   xmlns:rdf="http://www.w3.org/1999/02/22-rdf-syntax-ns#"
   xmlns:svg="http://www.w3.org/2000/svg"
   xmlns="http://www.w3.org/2000/svg"
   id="svg3690"
   version="1.1"
   viewBox="0 0 187.356 84.251556"
   height="84.251556mm"
   width="187.356mm">
  <defs
     id="defs3684" />
  <metadata
     id="metadata3687">
    <rdf:RDF>
      <cc:Work
         rdf:about="">
        <dc:format>image/svg+xml</dc:format>
        <dc:type
           rdf:resource="http://purl.org/dc/dcmitype/StillImage" />
        <dc:title></dc:title>
      </cc:Work>
    </rdf:RDF>
  </metadata>
  <g
     transform="translate(41.517287,-85.540888)"
     id="layer1">
    <g
       transform="rotate(90,77.863095,106.5)"
       id="layer1-7">
      <rect
         width="79.913589"
         height="182.81235"
         ry="9.6217031"
         x="58.799297"
         y="41.223061"
         id="rect27"
         style="fill:#cccccc;fill-opacity:1;stroke-width:0.26458332" />
      <g
         transform="translate(28.873651,8.0052721)"
         id="layer1-2">
        <rect
           width="63.491333"
           height="80.697914"
           ry="8.1933565"
           x="38.373249"
           y="127.66667"
           id="rect3699-3-9-2-0"
           style="fill:#666666;fill-opacity:1;stroke-width:0.26554987" />
        <path
           d="m 40.256112,30.519107 c -6.773115,0 -12.22578,5.483243 -12.22578,12.29434 V 205.58077 c 0,6.8111 5.452665,12.29434 12.22578,12.29434 h 59.799998 c 6.77312,0 12.22578,-5.48324 12.22578,-12.29434 V 42.813447 c 0,-6.811097 -5.45266,-12.29434 -12.22578,-12.29434 z m 1.99746,4.543393 h 55.805073 c 5.082085,0 9.173835,4.114176 9.173835,9.224759 V 204.37361 c 0,5.11058 -4.09175,9.22476 -9.173835,9.22476 H 42.253572 c -5.082084,0 -9.173829,-4.11418 -9.173829,-9.22476 V 44.287259 c 0,-5.110583 4.091745,-9.224759 9.173829,-9.224759 z"
           id="rect3680"
           style="fill:#666666;fill-opacity:1;stroke-width:0.26384455" />
        <path
           d="m 70.110247,148.89572 a 19.153276,19.119867 0 0 0 -19.153312,19.11991 19.153276,19.119867 0 0 0 19.153312,19.1199 19.153276,19.119867 0 0 0 19.153315,-19.1199 19.153276,19.119867 0 0 0 -19.153315,-19.11991 z m 0.06199,4.49856 a 14.579253,14.553823 0 0 1 14.579182,14.55427 14.579253,14.553823 0 0 1 -14.579185,14.55376 14.579253,14.553823 0 0 1 -14.579188,-14.55376 14.579253,14.553823 0 0 1 14.579188,-14.55427 z"
           id="COLORIZE1_1"
           style="fill:#ffaaaa;fill-opacity:1;stroke-width:0.26644385" />
        <rect
           width="5.2916665"
           height="38.36459"
           ry="0"
           x="67.464417"
           y="61.520828"
           id="rect3714"
           style="fill:#666666;fill-opacity:1;stroke-width:0.15819432" />
      </g>
    </g>
  </g>
</svg>
