<?xml version="1.0" encoding="UTF-8" standalone="no"?>
<svg
   xmlns:dc="http://purl.org/dc/elements/1.1/"
   xmlns:cc="http://creativecommons.org/ns#"
   xmlns:rdf="http://www.w3.org/1999/02/22-rdf-syntax-ns#"
   xmlns:svg="http://www.w3.org/2000/svg"
   xmlns="http://www.w3.org/2000/svg"
   width="84.476494mm"
   height="84.476494mm"
   viewBox="0 0 84.476494 84.476494"
   version="1.1"
   id="svg8">
  <defs
     id="defs2" />
  <metadata
     id="metadata5">
    <rdf:RDF>
      <cc:Work
         rdf:about="">
        <dc:format>image/svg+xml</dc:format>
        <dc:type
           rdf:resource="http://purl.org/dc/dcmitype/StillImage" />
        <dc:title></dc:title>
      </cc:Work>
    </rdf:RDF>
  </metadata>
  <g
     id="layer1"
     transform="translate(-56.896785,-82.506591)">
    <path
       style="display:inline;fill:#ece9d8;fill-opacity:1;stroke-width:0.92355269"
       d="M 374.68359,311.83594 A 159.64065,159.64065 0 0 0 215.04297,471.47656 159.64065,159.64065 0 0 0 374.68359,631.11719 159.64065,159.64065 0 0 0 534.32422,471.47656 159.64065,159.64065 0 0 0 374.68359,311.83594 Z m 0,19.66015 A 139.98109,139.98109 0 0 1 514.66602,471.47656 139.98109,139.98109 0 0 1 374.68359,611.45703 139.98109,139.98109 0 0 1 234.70312,471.47656 139.98109,139.98109 0 0 1 374.68359,331.49609 Z"
       transform="scale(0.26458333)"
       id="path4643" />
    <circle
       style="opacity:1;fill:#ea9c00;fill-opacity:1;stroke-width:0.26697904"
       id="COLORIZE1_1"
       cx="99.135033"
       cy="124.74484"
       r="37.230656" />
    <circle
       style="opacity:1;fill:#ece9d8;fill-opacity:1;stroke-width:0.2820957"
       id="path6417"
       cx="99.135033"
       cy="124.74484"
       r="34.4422" />
    <circle
       style="opacity:1;fill:#000000;fill-opacity:1;stroke-width:0.2721625"
       id="path6417-0"
       cx="99.135033"
       cy="124.74484"
       r="33.229412" />
    <circle
       style="opacity:1;fill:#4a4424;fill-opacity:1;stroke-width:0.26326209"
       id="path6417-0-0"
       cx="99.135033"
       cy="124.74484"
       r="32.142731" />
    <circle
       style="opacity:1;fill:#dcd9c8;fill-opacity:1;stroke-width:0.25552264"
       id="path6417-0-0-5"
       cx="99.135033"
       cy="124.74484"
       r="31.197788" />
  </g>
</svg>
