<?xml version="1.0" encoding="UTF-8" standalone="no"?>
<svg
   xmlns:dc="http://purl.org/dc/elements/1.1/"
   xmlns:cc="http://creativecommons.org/ns#"
   xmlns:rdf="http://www.w3.org/1999/02/22-rdf-syntax-ns#"
   xmlns:svg="http://www.w3.org/2000/svg"
   xmlns="http://www.w3.org/2000/svg"
   xmlns:sodipodi="http://sodipodi.sourceforge.net/DTD/sodipodi-0.dtd"
   xmlns:inkscape="http://www.inkscape.org/namespaces/inkscape"
   id="svg8"
   version="1.1"
   viewBox="0 0 187.356 84.251563"
   height="84.251564mm"
   width="187.356mm"
   sodipodi:docname="RockerSwitchHorizontalObject_Pressed.svg"
   inkscape:version="0.92.3 (2405546, 2018-03-11)">
  <sodipodi:namedview
     pagecolor="#ffffff"
     bordercolor="#666666"
     borderopacity="1"
     objecttolerance="10"
     gridtolerance="10"
     guidetolerance="10"
     inkscape:pageopacity="0"
     inkscape:pageshadow="2"
     inkscape:window-width="1920"
     inkscape:window-height="1017"
     id="namedview32"
     showgrid="false"
     fit-margin-top="0"
     fit-margin-left="0"
     fit-margin-right="0"
     fit-margin-bottom="0"
     inkscape:zoom="1.1975419"
     inkscape:cx="354.05859"
     inkscape:cy="159.21556"
     inkscape:window-x="1912"
     inkscape:window-y="29"
     inkscape:window-maximized="1"
     inkscape:current-layer="svg8" />
  <defs
     id="defs2" />
  <metadata
     id="metadata5">
    <rdf:RDF>
      <cc:Work
         rdf:about="">
        <dc:format>image/svg+xml</dc:format>
        <dc:type
           rdf:resource="http://purl.org/dc/dcmitype/StillImage" />
        <dc:title></dc:title>
      </cc:Work>
    </rdf:RDF>
  </metadata>
  <g
     transform="rotate(90,141.39218,84.4882)"
     id="layer1">
    <rect
       ry="9.6217031"
       y="41.223061"
       x="58.799297"
       height="182.81235"
       width="79.913589"
       id="rect27"
       style="fill:#ece9d8;fill-opacity:1;stroke-width:0.26458332" />
    <g
       transform="translate(28.873651,8.0052721)"
       id="layer1-2">
      <rect
         style="fill:#000000;fill-opacity:1;stroke-width:0.26554987"
         id="rect3699-3-9-2"
         width="63.491333"
         height="80.697914"
         x="38.364582"
         y="40.354168"
         ry="8.1933565" />
      <path
         style="fill:#ea9c00;fill-opacity:1;stroke-width:0.26384455"
         d="m 40.256112,30.519107 c -6.773115,0 -12.22578,5.483243 -12.22578,12.29434 V 205.58077 c 0,6.8111 5.452665,12.29434 12.22578,12.29434 h 59.799998 c 6.77312,0 12.22578,-5.48324 12.22578,-12.29434 V 42.813447 c 0,-6.811097 -5.45266,-12.29434 -12.22578,-12.29434 z m 1.99746,4.543393 h 55.805073 c 5.082085,0 9.173835,4.114176 9.173835,9.224759 V 204.37361 c 0,5.11058 -4.09175,9.22476 -9.173835,9.22476 H 42.253572 c -5.082084,0 -9.173829,-4.11418 -9.173829,-9.22476 V 44.287259 c 0,-5.110583 4.091745,-9.224759 9.173829,-9.224759 z"
         id="rect3680"
         inkscape:connector-curvature="0" />
      <path
         style="fill:#000000;fill-opacity:1;stroke-width:0.26644385"
         d="m 70.110247,148.89572 a 19.153276,19.119867 0 0 0 -19.153312,19.11991 19.153276,19.119867 0 0 0 19.153312,19.1199 19.153276,19.119867 0 0 0 19.153315,-19.1199 19.153276,19.119867 0 0 0 -19.153315,-19.11991 z m 0.06199,4.49856 a 14.579253,14.553823 0 0 1 14.579182,14.55427 14.579253,14.553823 0 0 1 -14.579185,14.55376 14.579253,14.553823 0 0 1 -14.579188,-14.55376 14.579253,14.553823 0 0 1 14.579188,-14.55427 z"
         id="path3707"
         inkscape:connector-curvature="0" />
      <rect
         style="fill:#00ff00;fill-opacity:1;stroke-width:0.15819432"
         id="COLORIZE2_1"
         width="5.2916665"
         height="38.36459"
         x="67.464417"
         y="61.520828"
         ry="0" />
    </g>
  </g>
</svg>
