<?xml version="1.0" encoding="UTF-8" standalone="no"?>
<!-- Created with Inkscape (http://www.inkscape.org/) -->

<svg
   xmlns:dc="http://purl.org/dc/elements/1.1/"
   xmlns:cc="http://creativecommons.org/ns#"
   xmlns:rdf="http://www.w3.org/1999/02/22-rdf-syntax-ns#"
   xmlns:svg="http://www.w3.org/2000/svg"
   xmlns="http://www.w3.org/2000/svg"
   xmlns:sodipodi="http://sodipodi.sourceforge.net/DTD/sodipodi-0.dtd"
   xmlns:inkscape="http://www.inkscape.org/namespaces/inkscape"
   version="1.1"
   width="428.409"
   height="345.86203"
   id="svg3041"
   sodipodi:docname="image_classic.svg"
   inkscape:version="0.92.0 r15299">
  <sodipodi:namedview
     pagecolor="#ffffff"
     bordercolor="#666666"
     borderopacity="1"
     objecttolerance="10"
     gridtolerance="10"
     guidetolerance="10"
     inkscape:pageopacity="0"
     inkscape:pageshadow="2"
     inkscape:window-width="1920"
     inkscape:window-height="983"
     id="namedview4510"
     showgrid="false"
     fit-margin-top="0"
     fit-margin-left="0"
     fit-margin-right="0"
     fit-margin-bottom="0"
     inkscape:zoom="1.5354018"
     inkscape:cx="195.67735"
     inkscape:cy="165.00926"
     inkscape:window-x="-9"
     inkscape:window-y="-9"
     inkscape:window-maximized="1"
     inkscape:current-layer="layer1" />
  <defs
     id="defs3043" />
  <metadata
     id="metadata3046">
    <rdf:RDF>
      <cc:Work
         rdf:about="">
        <dc:format>image/svg+xml</dc:format>
        <dc:type
           rdf:resource="http://purl.org/dc/dcmitype/StillImage" />
        <dc:title></dc:title>
      </cc:Work>
    </rdf:RDF>
  </metadata>
  <g
     transform="translate(-160.08121,-342.2883)"
     id="layer1">
    <rect
       width="428.40799"
       height="345.86099"
       x="160.08122"
       y="342.2883"
       id="rect3209"
       style="fill:#fffbff;fill-opacity:1" />
    <path
       d="m 384.73421,688.15033 h -224.653 v -87.77101 c 17.763,-5.224 37.616,-7.314 57.469,-7.314 25.078,0 50.155,4.18 71.053,12.539 6.269,2.09 11.494,4.18 16.718,7.314 36.573,16.717 64.785,42.84 79.413,75.23201 z"
       id="path3211"
       style="fill:#494949;fill-opacity:1"
       inkscape:connector-curvature="0" />
    <path
       d="m 588.49021,577.39032 v 110.75901 h -337.502 c 9.404,-29.25701 29.257,-55.38001 55.38,-76.27801 42.841,-34.482 103.445,-55.38 172.408,-55.38 38.661,0.002 77.322,7.316 109.714,20.899 z"
       id="path3213"
       style="fill:#868686;fill-opacity:1"
       inkscape:connector-curvature="0" />
    <g
       transform="translate(123.51021,305.71733)"
       id="g3215">
      <circle
         cx="122.253"
         cy="122.253"
         r="42.841"
         id="circle3217"
         style="fill:#dcdcdc;fill-opacity:1" />
      <path
         d="m 433.633,101.355 c 1.045,-3.135 1.045,-6.269 1.045,-9.404 0,-16.718 -13.584,-31.347 -31.347,-31.347 -11.494,0 -21.943,6.269 -27.167,15.673 -3.135,-2.09 -7.314,-2.09 -11.494,-2.09 -14.629,0 -26.122,10.449 -28.212,24.033 -8.359,2.09 -14.629,9.404 -14.629,17.763 0,10.449 8.359,18.808 18.808,18.808 h 82.547 c 10.449,0 18.808,-8.359 18.808,-18.808 0,-6.269 -3.135,-11.493 -8.359,-14.628 z"
         id="path3219"
         style="fill:#c8c8c8;fill-opacity:1"
         inkscape:connector-curvature="0" />
    </g>
    <g
       transform="translate(123.51021,305.71733)"
       id="g3221" />
    <g
       transform="translate(123.51021,305.71733)"
       id="g3223" />
    <g
       transform="translate(123.51021,305.71733)"
       id="g3225" />
    <g
       transform="translate(123.51021,305.71733)"
       id="g3227" />
    <g
       transform="translate(123.51021,305.71733)"
       id="g3229" />
    <g
       transform="translate(123.51021,305.71733)"
       id="g3231" />
    <g
       transform="translate(123.51021,305.71733)"
       id="g3233" />
    <g
       transform="translate(123.51021,305.71733)"
       id="g3235" />
    <g
       transform="translate(123.51021,305.71733)"
       id="g3237" />
    <g
       transform="translate(123.51021,305.71733)"
       id="g3239" />
    <g
       transform="translate(123.51021,305.71733)"
       id="g3241" />
    <g
       transform="translate(123.51021,305.71733)"
       id="g3243" />
    <g
       transform="translate(123.51021,305.71733)"
       id="g3245" />
    <g
       transform="translate(123.51021,305.71733)"
       id="g3247" />
    <g
       transform="translate(123.51021,305.71733)"
       id="g3249" />
  </g>
</svg>
