CMP250.0M CMP250.0M PRESSURE TRANSMITTER
Type code: 8270 74 2517 35 0000 0000 52 43
Link: https://www.trafag.com/en/cmp250-0m/

CMP4.0M CMP4.0M PRESSURE TRANSMITTER
Type code: 8270 76 2517 35 0000 0000 52 43
Link: https://www.trafag.com/en/cmp4-0m/