-40.0 190953 19.095 8.37 -5.46 1.53 174965 206940
-35.0 145953 14.595 8.05 -5.30 1.52 134205 157700
-30.0 112440 11.244 7.74 -5.14 1.51 103739 121141
-25.0 87285 8.7285 7.44 -4.99 1.49 80792 93779
-20.0 68260 6.8260 7.15 -4.85 1.48 63377 73142
-15.0 53762 5.3762 6.88 -4.71 1.46 50066 57459
-10.0 42636 4.2636 6.61 -4.57 1.45 39818 45455
-5.0 34038 3.4038 6.35 -4.44 1.43 31875 36201
0.0 27348 2.7348 6.11 -4.31 1.42 25677 29018
5.0 22108 2.2108 5.87 -4.19 1.40 20810 23406
10.0 17979 1.7979 5.64 -4.08 1.38 16965 18994
15.0 14706 1.4706 5.42 -3.96 1.37 13908 15503
20.0 12094 1.2094 5.21 -3.86 1.35 11465 12724
25.0 10000 1.0000 5.00 -3.75 1.33 9500.0 10500
30.0 8310.8 0.83108 5.20 -3.65 1.42 7878.6 8742.9
35.0 6941.1 0.69411 5.39 -3.55 1.52 6566.8 7315.4
40.0 5824.9 0.58249 5.58 -3.46 1.61 5499.8 6149.9
45.0 4910.6 0.49106 5.76 -3.37 1.71 4627.7 5193.5
50.0 4158.3 0.41583 5.94 -3.28 1.81 3911.4 4405.1
55.0 3536.2 0.35362 6.11 -3.20 1.91 3320.3 3752.2
60.0 3019.7 0.30197 6.27 -3.12 2.01 2830.3 3209.0
65.0 2588.8 0.25888 6.43 -3.04 2.12 2422.3 2755.3
70.0 2228.0 0.22280 6.59 -2.96 2.22 2081.2 2374.7
75.0 1924.6 0.19246 6.74 -2.89 2.33 1794.9 2054.2
80.0 1668.4 0.16684 6.88 -2.82 2.44 1553.5 1783.3
85.0 1451.3 0.14513 7.03 -2.75 2.55 1349.4 1553.3
90.0 1266.7 0.12667 7.17 -2.69 2.67 1176.0 1357.5
95.0 1109.2 0.11092 7.30 -2.62 2.78 1028.2 1190.2
100.0 974.26 0.097426 7.43 -2.56 2.90 901.86 1046.7
105.0 858.33 0.085833 7.56 -2.50 3.02 793.45 923.21