{
    "webAppProjects": [
        {"text": "Journaliste pour la paix", "url": "https://journalistepourlapaix.fr/", "image": "https://journalistepourlapaix.fr/img/julian_noiseless.png"}
    ],

    "events": [
        {"date": "10 Mai 2018", "title": "Création d'un serveur Discord", "details": "L'idée est venu.\nNous tentons quelques experimentations sur Unity/Blender & autour du développement web."},
        {"date": "2019", "title": "La vie suis son cours ...", "details": "Toujours à s'essayer sur des sujets à la péripherie de nos métiers.\nOn apprend progressivement à s'organiser en dehors du travail."},
        {"date": "Octobre 2020", "title": "Hello AfterThinking 👋", "details": "Depuis, nos membres viennent majoriterement de ce groupe !"},
        {"date": "Novembre 2020", "title": "Premiers projets utiles", "details": "Les besoins de l'AfterThinking et le cas Assange nous ont offert nos premiers projets avec de vrai enjeux."},
        {"date": "Fin 2020, début 2021", "title": "Journaliste pour la paix", "details": "Nous contribuons au mieux pour le projet \"Asile Pour Assange\".\n"}
    ]
}