<?xml version="1.0" encoding="UTF-8" standalone="no"?>
<svg
   xmlns:dc="http://purl.org/dc/elements/1.1/"
   xmlns:cc="http://creativecommons.org/ns#"
   xmlns:rdf="http://www.w3.org/1999/02/22-rdf-syntax-ns#"
   xmlns:svg="http://www.w3.org/2000/svg"
   xmlns="http://www.w3.org/2000/svg"
   xmlns:sodipodi="http://sodipodi.sourceforge.net/DTD/sodipodi-0.dtd"
   xmlns:inkscape="http://www.inkscape.org/namespaces/inkscape"
   width="500"
   height="500"
   viewBox="0 0 500 500"
   version="1.1"
   id="svg8"
   inkscape:version="1.0 (4035a4fb49, 2020-05-01)"
   sodipodi:docname="techunit-org-full-noir_blanc-fond_sombre-v1.svg">
  <defs
     id="defs2" />
  <sodipodi:namedview
     inkscape:pagecheckerboard="true"
     units="px"
     id="base"
     pagecolor="#ffffff"
     bordercolor="#666666"
     borderopacity="1.0"
     inkscape:pageopacity="0.0"
     inkscape:pageshadow="2"
     inkscape:zoom="2.5"
     inkscape:cx="148.76749"
     inkscape:cy="215.7983"
     inkscape:document-units="px"
     inkscape:current-layer="layer1"
     inkscape:document-rotation="0"
     showgrid="false"
     inkscape:window-width="2736"
     inkscape:window-height="1744"
     inkscape:window-x="-11"
     inkscape:window-y="-11"
     inkscape:window-maximized="1" />
  <metadata
     id="metadata5">
    <rdf:RDF>
      <cc:Work
         rdf:about="">
        <dc:format>image/svg+xml</dc:format>
        <dc:type
           rdf:resource="http://purl.org/dc/dcmitype/StillImage" />
        <dc:title></dc:title>
      </cc:Work>
    </rdf:RDF>
  </metadata>
  <g
     inkscape:label="Calque 1"
     inkscape:groupmode="layer"
     id="layer1">
    <path
       id="path69-1"
       d="m 100.88564,325.95441 c 4.51885,-0.17799 9.24403,0.004 13.53494,-1.55443 2.16461,-1.03799 0.73556,-3.57616 -0.76694,-4.52286 -4.95163,-4.84362 -10.27685,-9.77974 -12.60495,-16.50897 -5.105809,-13.09412 -2.709663,-27.72778 1.68312,-40.66265 3.99219,-11.55708 9.87827,-22.47421 16.10102,-32.93313 25.72585,-42.45614 62.85646,-77.38178 104.04779,-104.64149 16.51712,-10.7071 33.35064,-21.20963 51.60888,-28.715677 5.41216,-2.275006 11.11998,-3.803681 16.72782,-5.406969 2.4047,-1.042799 0.58167,-4.499055 -1.73449,-3.739318 -6.67657,-0.29703 -12.84491,2.825283 -19.14104,4.561465 -18.70294,5.855633 -36.35317,14.578229 -53.52367,23.925639 -36.66287,20.28778 -69.06669,47.49124 -98.22769,77.40717 -19.451862,20.40156 -37.489501,42.84431 -48.831409,68.86054 -3.592268,8.63851 -6.761219,17.62419 -7.799099,26.96514 -0.08712,6.97398 -0.84817,14.47204 2.6824,20.81952 3.976078,8.65552 13.027961,13.8412 22.17346,15.26323 4.640211,0.79631 9.372534,0.89466 14.069858,0.88279 z"
       style="fill:#ffffff;fill-opacity:1;stroke-width:0.324687" />
    <path
       id="path71-2"
       d="m 436.29677,108.58118 c 2.80008,-0.52858 1.98251,-3.91566 1.6482,-5.92049 -1.52557,-10.303765 -7.69659,-19.321438 -15.45675,-26.023101 -13.74726,-11.849716 -31.12494,-18.49445 -48.48035,-23.04003 -35.79998,-9.091613 -74.15518,-6.755586 -108.99634,5.213242 -16.29691,5.807753 -31.92042,15.876826 -40.66374,31.204389 -2.72296,4.934688 -5.18211,10.21143 -6.11041,15.7947 0.19676,2.43051 3.29605,2.37013 4.66746,0.95046 6.15158,-4.63048 11.20083,-10.547623 17.94714,-14.426256 15.76834,-9.866933 33.99933,-15.448516 52.14155,-18.906687 34.86692,-6.250973 71.52371,-3.610028 104.37307,9.67974 9.1072,3.352352 17.11358,8.964651 24.6027,15.029482 4.40608,3.411041 8.62174,7.130911 13.24625,10.259981 0.33758,0.17724 0.71324,0.16523 1.08122,0.18438 z"
       style="fill:#ffffff;fill-opacity:1;stroke-width:0.324687" />
    <path
       style="fill:#999999;fill-opacity:1;stroke-width:0.331181"
       d="m 208.18605,344.67948 c -0.77309,-0.77309 -0.85697,-1.74447 -0.19789,-2.29147 0.25546,-0.21201 3.18275,-1.20285 6.50507,-2.20186 7.22641,-2.17296 11.22728,-3.70191 18.60789,-7.11117 14.73172,-6.80487 37.29898,-20.33123 55.2308,-33.1042 41.69818,-29.70199 74.04346,-64.20257 95.78749,-102.1702 12.01404,-20.97792 17.47917,-37.25215 17.47518,-52.03797 -0.002,-5.71061 -0.56736,-9.70783 -2.02165,-14.28192 -1.96124,-6.16853 -4.19466,-9.51746 -10.67589,-16.00809 -4.24622,-4.25239 -5.06272,-5.53362 -4.1244,-6.47193 0.88392,-0.88392 4.00863,-1.46811 9.85056,-1.84161 6.46757,-0.41351 15.15442,-0.003 19.5576,0.92492 11.6601,2.45641 19.8919,9.64573 22.7138,19.83734 0.72726,2.62641 1.03848,13.92211 0.49038,17.79757 -0.55695,3.9384 -1.77538,8.85255 -3.51351,14.17088 -9.66502,29.5725 -32.66008,61.3286 -69.53345,96.02545 -30.35267,28.56104 -57.32981,48.23826 -89.25337,65.1017 -14.16526,7.48273 -28.37982,13.86205 -39.06659,17.53265 -7.42076,2.5488 -17.91119,5.82207 -20.15372,6.28843 -3.57693,0.74388 -6.84335,0.67645 -7.67831,-0.1585 z"
       id="path109" />
    <path
       style="fill:#999999;fill-opacity:1;stroke-width:0.331181"
       d="M 156.85294,384.07521 C 141.51456,382.7831 127.83745,380.03744 114.13056,375.49893 96.391956,369.6254 83.880516,362.54024 74.37993,352.98848 67.305997,345.8764 63.487321,338.80269 61.996141,330.04879 c -0.710941,-4.17351 -0.259037,-5.57189 1.794867,-5.55402 0.861432,0.008 2.983135,1.56776 13.620831,10.01661 10.018936,7.95742 16.966322,12.21982 24.961791,15.31468 16.78202,6.49597 30.93633,9.93911 49.19078,11.96601 7.81349,0.8676 30.80941,0.87385 38.73785,0.0106 22.71197,-2.47292 42.34644,-7.72116 58.45349,-15.62444 9.29527,-4.56093 13.8205,-7.5515 20.94102,-13.83921 8.6227,-7.61419 9.45178,-8.10311 11.04288,-6.51198 0.8147,0.81468 0.69855,1.99136 -0.58539,5.93034 -2.7708,8.50044 -7.87525,16.65378 -14.56261,23.26081 -9.1174,9.00786 -19.69054,15.1118 -34.55409,19.94807 -13.03341,4.24075 -25.85101,6.9405 -41.06648,8.6497 -5.59139,0.62812 -27.50659,0.93204 -33.11814,0.45921 z"
       id="path111" />
    <g
       aria-label="techUnit"
       id="text19"
       style="font-size:64px;line-height:1.25;font-family:'Arial Monospaced MT';-inkscape-font-specification:'Arial Monospaced MT';fill:#ffffff">
      <path
         d="m 129.7035,448.76798 q -1.024,0.512 -3.392,0.896 -2.368,0.384 -4.992,0.384 -3.008,0 -5.184,-0.832 -2.112,-0.832 -3.52,-2.24 -1.408,-1.408 -2.048,-3.328 -0.64,-1.92 -0.64,-4.096 v -18.752 h -8.256 v -4.352 h 8.256 v -8.256 l 5.632,-3.392 v 11.648 h 11.712 v 4.352 h -11.712 v 18.304 q 0,3.008 1.6,4.544 1.664,1.536 4.608,1.536 1.024,0 2.112,-0.128 1.088,-0.128 2.048,-0.256 0.96,-0.192 1.728,-0.384 0.832,-0.192 1.216,-0.384 z"
         style="font-size:64px;fill:#ffffff"
         id="path21" />
      <path
         d="m 170.5105,434.43198 h -24.832 q 0.192,3.008 1.088,5.12 0.896,2.112 2.24,3.52 1.408,1.408 3.136,2.048 1.792,0.64 3.648,0.64 2.368,0 3.904,-0.768 1.6,-0.832 2.56,-1.92 1.024,-1.088 1.536,-2.24 0.512,-1.216 0.768,-1.92 l 5.76,0.704 q -0.64,2.368 -1.856,4.352 -1.152,1.92 -2.944,3.392 -1.792,1.408 -4.224,2.24 -2.432,0.768 -5.504,0.768 -3.84,0 -6.848,-1.216 -2.944,-1.216 -4.992,-3.456 -1.984,-2.304 -3.008,-5.44 -1.024,-3.136 -1.024,-6.976 0,-3.776 0.96,-6.976 1.024,-3.264 3.008,-5.568 1.984,-2.368 4.864,-3.712 2.944,-1.344 6.72,-1.344 0.704,0 2.048,0.128 1.408,0.128 3.072,0.704 1.664,0.512 3.392,1.664 1.792,1.088 3.2,3.072 1.472,1.984 2.368,5.056 0.96,3.072 0.96,7.424 z m -5.76,-4.608 q -0.128,-0.896 -0.256,-1.92 -0.128,-1.088 -0.64,-2.304 -0.896,-2.112 -3.136,-3.712 -2.176,-1.6 -5.248,-1.6 -2.368,0 -4.096,0.896 -1.728,0.832 -2.88,2.24 -1.152,1.408 -1.792,3.136 -0.576,1.664 -0.704,3.264 z"
         style="font-size:64px;fill:#ffffff"
         id="path23" />
      <path
         d="m 208.5015,438.14398 q -0.384,2.944 -1.728,5.248 -1.28,2.24 -3.2,3.84 -1.92,1.536 -4.416,2.368 -2.432,0.768 -5.12,0.768 -3.648,0 -6.592,-1.216 -2.944,-1.216 -4.992,-3.456 -1.984,-2.304 -3.072,-5.44 -1.088,-3.2 -1.088,-7.168 0,-4.864 1.344,-8.192 1.408,-3.328 3.648,-5.376 2.24,-2.048 5.056,-2.944 2.816,-0.896 5.696,-0.896 3.2,0 5.632,0.896 2.496,0.832 4.224,2.304 1.728,1.472 2.688,3.392 1.024,1.856 1.344,3.904 l -5.44,0.832 q -0.896,-3.648 -3.136,-5.184 -2.176,-1.536 -5.056,-1.536 -3.008,0 -4.992,1.152 -1.984,1.152 -3.136,3.008 -1.152,1.792 -1.664,4.096 -0.448,2.24 -0.448,4.416 0,2.24 0.512,4.544 0.512,2.24 1.664,4.096 1.216,1.792 3.072,3.008 1.92,1.152 4.672,1.152 2.368,0 4.032,-0.768 1.664,-0.832 2.688,-2.048 1.088,-1.28 1.6,-2.752 0.512,-1.472 0.64,-2.752 z"
         style="font-size:64px;fill:#ffffff"
         id="path25" />
      <path
         d="m 245.2125,449.59998 h -5.632 v -20.928 q 0,-0.704 -0.128,-2.048 -0.064,-1.408 -0.768,-2.752 -0.64,-1.344 -2.048,-2.304 -1.408,-1.024 -4.032,-1.024 -2.368,0 -4.48,1.152 -2.048,1.152 -2.944,2.88 -0.96,1.856 -1.216,3.584 -0.192,1.664 -0.192,3.328 v 18.112 h -5.632 v -45.824 h 5.632 v 16.448 q 1.344,-1.536 2.752,-2.432 1.408,-0.96 2.688,-1.408 1.344,-0.448 2.496,-0.576 1.152,-0.128 2.048,-0.128 1.344,0 2.752,0.256 1.472,0.256 2.816,0.832 1.344,0.512 2.496,1.408 1.152,0.896 1.856,2.176 1.088,1.984 1.28,4.224 0.256,2.176 0.256,4.032 z"
         style="font-size:64px;fill:#ffffff"
         id="path27" />
      <path
         d="m 284.0995,430.91198 q 0,1.536 -0.064,3.584 -0.064,1.984 -0.512,4.16 -0.384,2.176 -1.28,4.288 -0.896,2.048 -2.496,3.712 -1.6,1.664 -4.032,2.688 -2.432,1.024 -5.952,1.024 -3.264,0 -5.568,-0.832 -2.304,-0.896 -3.84,-2.368 -1.536,-1.536 -2.432,-3.456 -0.896,-1.984 -1.344,-4.16 -0.384,-2.176 -0.512,-4.352 -0.128,-2.24 -0.128,-4.288 v -27.136 h 6.08 v 27.072 q 0,2.688 0.256,5.248 0.256,2.56 1.088,4.544 0.832,1.92 2.368,3.136 1.536,1.152 4.16,1.152 2.752,0 4.352,-1.024 1.6,-1.024 2.432,-2.88 0.832,-1.92 1.088,-4.48 0.256,-2.624 0.256,-5.696 v -27.072 h 6.08 z"
         style="font-size:64px;fill:#ffffff"
         id="path29" />
      <path
         d="m 299.9465,421.11998 h 0.128 q 1.216,-1.856 2.688,-2.944 1.472,-1.088 2.944,-1.6 1.472,-0.576 2.752,-0.704 1.28,-0.192 2.112,-0.192 1.28,0 2.688,0.256 1.472,0.256 2.816,0.832 1.408,0.576 2.56,1.536 1.152,0.896 1.856,2.24 1.088,2.048 1.28,4.032 0.192,1.984 0.192,4.608 v 20.416 h -5.632 v -20.16 q 0,-1.088 -0.128,-2.624 -0.064,-1.536 -0.768,-2.88 -0.64,-1.408 -2.048,-2.368 -1.408,-1.024 -3.968,-1.024 -2.304,0 -4.032,0.896 -1.664,0.896 -2.752,2.432 -1.088,1.472 -1.6,3.456 -0.512,1.984 -0.512,4.16 v 18.112 h -5.632 v -33.152 h 5.056 z"
         style="font-size:64px;fill:#ffffff"
         id="path31" />
      <path
         d="m 351.3135,410.81598 h -6.4 v -7.04 h 6.4 z m -0.384,38.784 h -5.632 v -28.8 h -10.944 v -4.352 h 16.576 z"
         style="font-size:64px;fill:#ffffff"
         id="path33" />
      <path
         d="m 398.3285,448.76798 q -1.024,0.512 -3.392,0.896 -2.368,0.384 -4.992,0.384 -3.008,0 -5.184,-0.832 -2.112,-0.832 -3.52,-2.24 -1.408,-1.408 -2.048,-3.328 -0.64,-1.92 -0.64,-4.096 v -18.752 h -8.256 v -4.352 h 8.256 v -8.256 l 5.632,-3.392 v 11.648 h 11.712 v 4.352 h -11.712 v 18.304 q 0,3.008 1.6,4.544 1.664,1.536 4.608,1.536 1.024,0 2.112,-0.128 1.088,-0.128 2.048,-0.256 0.96,-0.192 1.728,-0.384 0.832,-0.192 1.216,-0.384 z"
         style="font-size:64px;fill:#ffffff"
         id="path35" />
    </g>
  </g>
</svg>
