<?xml version="1.0" encoding="UTF-8" standalone="no"?>
<svg
   xmlns:dc="http://purl.org/dc/elements/1.1/"
   xmlns:cc="http://creativecommons.org/ns#"
   xmlns:rdf="http://www.w3.org/1999/02/22-rdf-syntax-ns#"
   xmlns:svg="http://www.w3.org/2000/svg"
   xmlns="http://www.w3.org/2000/svg"
   xmlns:sodipodi="http://sodipodi.sourceforge.net/DTD/sodipodi-0.dtd"
   xmlns:inkscape="http://www.inkscape.org/namespaces/inkscape"
   sodipodi:docname="techunit-org-logo-noir_blanc-simple-v1.svg"
   inkscape:version="1.0 (4035a4fb49, 2020-05-01)"
   id="svg8"
   version="1.1"
   viewBox="0 0 500 448"
   height="448"
   width="500">
  <defs
     id="defs2" />
  <sodipodi:namedview
     inkscape:window-maximized="1"
     inkscape:window-y="-11"
     inkscape:window-x="-11"
     inkscape:window-height="1744"
     inkscape:window-width="2736"
     showgrid="false"
     inkscape:document-rotation="0"
     inkscape:current-layer="layer1"
     inkscape:document-units="px"
     inkscape:cy="215.7983"
     inkscape:cx="272.36749"
     inkscape:zoom="2.5"
     inkscape:pageshadow="2"
     inkscape:pageopacity="0.0"
     borderopacity="1.0"
     bordercolor="#666666"
     pagecolor="#ffffff"
     id="base"
     units="px"
     inkscape:pagecheckerboard="true" />
  <metadata
     id="metadata5">
    <rdf:RDF>
      <cc:Work
         rdf:about="">
        <dc:format>image/svg+xml</dc:format>
        <dc:type
           rdf:resource="http://purl.org/dc/dcmitype/StillImage" />
        <dc:title></dc:title>
      </cc:Work>
    </rdf:RDF>
  </metadata>
  <g
     id="layer1"
     inkscape:groupmode="layer"
     inkscape:label="Calque 1">
    <path
       style="fill:#ffffff;fill-opacity:1;stroke-width:0.424428;stroke:none;stroke-opacity:1"
       d="m 55.789986,367.67597 c 5.906986,-0.23266 12.083703,0.005 17.692732,-2.03193 2.82956,-1.35685 0.96152,-4.67472 -1.002544,-5.91224 -6.472709,-6.33153 -13.433782,-12.78397 -16.477055,-21.58035 -6.674258,-17.1165 -3.542041,-36.24546 2.200161,-53.15379 5.218546,-15.10729 12.912776,-29.37805 21.047077,-43.04985 33.628563,-55.49821 82.165313,-101.15265 136.010193,-136.78625 21.591,-13.996219 43.5956,-27.725011 67.46259,-37.536838 7.07471,-2.973864 14.53592,-4.972132 21.86643,-7.067934 3.1434,-1.363136 0.76035,-5.881117 -2.26731,-4.887997 -8.72755,-0.388275 -16.79073,3.69318 -25.02097,5.962699 C 252.853,69.285912 229.78081,80.687998 207.33571,92.906836 159.41039,119.42681 117.05246,154.98689 78.933504,194.09268 53.50623,220.76139 29.927617,250.09831 15.101593,284.10645 c -4.695775,11.29218 -8.8381945,23.03816 -10.1948997,35.24856 -0.113881,9.11631 -1.1087196,18.91769 3.5064047,27.21505 5.197488,11.31441 17.030015,18.09308 28.984915,19.95194 6.065635,1.04093 12.251678,1.16949 18.391973,1.15397 z"
       id="path69-1" />
    <path
       style="fill:#ffffff;fill-opacity:1;stroke-width:0.424428;stroke:none;stroke-opacity:1"
       d="m 494.2359,83.527953 c 3.66024,-0.690944 2.59152,-5.118508 2.15451,-7.739193 C 494.39621,62.319783 486.32952,50.531975 476.18552,41.771632 458.21524,26.281807 435.49932,17.59588 412.81251,11.653945 366.01515,-0.23051571 315.87763,2.823114 270.33363,18.46864 c -21.30315,7.591835 -41.72604,20.754022 -53.15521,40.790052 -3.55943,6.450572 -6.77401,13.348273 -7.98747,20.646669 0.25721,3.177131 4.30857,3.0982 6.10126,1.242431 8.04128,-6.052921 14.64161,-13.787745 23.46031,-18.857854 20.61221,-12.897951 44.44357,-20.194138 68.15889,-24.714623 45.57767,-8.171206 93.49504,-4.718991 136.43538,12.653255 11.90484,4.382159 22.3707,11.718498 32.1604,19.646381 5.75958,4.458882 11.27024,9.321451 17.31535,13.411741 0.44129,0.23169 0.93235,0.215981 1.41336,0.241016 z"
       id="path71-2" />
    <path
       id="path109"
       d="m 196.05196,392.15319 c -1.01058,-1.01058 -1.12023,-2.28035 -0.25868,-2.99539 0.33393,-0.27714 4.16045,-1.57235 8.50336,-2.87825 9.44628,-2.84046 14.67618,-4.8391 24.32404,-9.29564 19.25715,-8.89526 48.75683,-26.57678 72.19712,-43.27347 54.50743,-38.82613 96.78884,-83.92492 125.21241,-133.55582 15.70462,-27.42211 22.84859,-48.69562 22.84337,-68.02349 -0.003,-7.46485 -0.74165,-12.68997 -2.64268,-18.66917 -2.56371,-8.06344 -5.48321,-12.44112 -13.95541,-20.92561 -5.55062,-5.558677 -6.61794,-7.233484 -5.39137,-8.460035 1.15544,-1.15546 5.24004,-1.919096 12.87654,-2.407336 8.45434,-0.540542 19.8097,-0.0039 25.56549,1.209043 15.24196,3.210991 26.00249,12.608802 29.69125,25.931168 0.95066,3.43322 1.35749,18.19883 0.64102,23.26479 -0.72805,5.14824 -2.32076,11.57197 -4.59283,18.52403 -12.63401,38.65687 -42.69291,80.16811 -90.8934,125.52347 -39.67669,37.33469 -74.94092,63.05654 -116.67107,85.10026 -18.51668,9.78134 -37.0978,18.12033 -51.06744,22.91849 -9.70034,3.33177 -23.41332,7.61055 -26.34473,8.22018 -4.67573,0.97238 -8.94555,0.88424 -10.037,-0.2072 z"
       style="fill:#999999;fill-opacity:1;stroke-width:0.432916" />
    <path
       id="path111"
       d="M 128.94986,443.65087 C 108.89968,441.96184 91.021108,438.37275 73.103603,432.44005 49.915888,424.76224 33.561064,415.50059 21.141997,403.01462 11.895026,393.71779 6.9032927,384.47111 4.9540373,373.0281 c -0.9293335,-5.45556 -0.3386093,-7.28351 2.3462316,-7.26016 1.126055,0.0103 3.8995231,2.04936 17.8050081,13.09362 13.096648,10.40185 22.178199,15.97362 32.629786,20.01919 21.937282,8.49146 40.439656,12.99229 64.301677,15.64184 10.21372,1.13411 40.27374,1.14229 50.63772,0.0138 29.68884,-3.23258 55.35482,-10.09302 76.40979,-20.4241 12.15067,-5.962 18.06601,-9.87125 27.37388,-18.09048 11.2715,-9.95319 12.35526,-10.59229 14.43514,-8.51239 1.06496,1.06494 0.91313,2.60309 -0.76522,7.75208 -3.62196,11.11169 -10.29445,21.76965 -19.03609,30.40629 -11.91817,11.77498 -25.73927,19.75399 -45.16875,26.07591 -17.03714,5.54346 -33.79217,9.07255 -53.68167,11.3068 -7.30901,0.82107 -35.95633,1.21835 -43.29168,0.60027 z"
       style="fill:#999999;fill-opacity:1;stroke-width:0.432916" />
  </g>
</svg>
