<mxfile host="app.diagrams.net" modified="2020-11-15T23:27:42.034Z" agent="5.0 (Windows NT 10.0; Win64; x64) AppleWebKit/537.36 (KHTML, like Gecko) Chrome/86.0.4240.193 Safari/537.36" etag="oYE34FNfIj3H4-5QlJM_" version="13.9.8" type="gitlab">
  <diagram id="UaOBRDm2fXHQbeQWjVJh" name="Page-1">
    <mxGraphModel dx="1422" dy="705" grid="1" gridSize="10" guides="1" tooltips="1" connect="1" arrows="1" fold="1" page="1" pageScale="1" pageWidth="850" pageHeight="1100" math="0" shadow="0">
      <root>
        <mxCell id="0" />
        <mxCell id="1" parent="0" />
        <mxCell id="x4kZl2lfx9yoxjno1X_8-1" value="Question" style="shape=table;startSize=30;container=1;collapsible=1;childLayout=tableLayout;fixedRows=1;rowLines=0;fontStyle=1;align=center;resizeLast=1;" parent="1" vertex="1">
          <mxGeometry x="210" y="40" width="170" height="160" as="geometry" />
        </mxCell>
        <mxCell id="x4kZl2lfx9yoxjno1X_8-2" value="" style="shape=partialRectangle;collapsible=0;dropTarget=0;pointerEvents=0;fillColor=none;points=[[0,0.5],[1,0.5]];portConstraint=eastwest;top=0;left=0;right=0;bottom=1;" parent="x4kZl2lfx9yoxjno1X_8-1" vertex="1">
          <mxGeometry y="30" width="170" height="20" as="geometry" />
        </mxCell>
        <mxCell id="x4kZl2lfx9yoxjno1X_8-3" value="" style="shape=partialRectangle;overflow=hidden;connectable=0;fillColor=none;top=0;left=0;bottom=0;right=0;fontStyle=1;" parent="x4kZl2lfx9yoxjno1X_8-2" vertex="1">
          <mxGeometry width="30" height="20" as="geometry" />
        </mxCell>
        <mxCell id="x4kZl2lfx9yoxjno1X_8-4" value="" style="shape=partialRectangle;overflow=hidden;connectable=0;fillColor=none;top=0;left=0;bottom=0;right=0;align=left;spacingLeft=6;fontStyle=5;" parent="x4kZl2lfx9yoxjno1X_8-2" vertex="1">
          <mxGeometry x="30" width="140" height="20" as="geometry" />
        </mxCell>
        <mxCell id="x4kZl2lfx9yoxjno1X_8-5" value="" style="shape=partialRectangle;collapsible=0;dropTarget=0;pointerEvents=0;fillColor=none;points=[[0,0.5],[1,0.5]];portConstraint=eastwest;top=0;left=0;right=0;bottom=0;" parent="x4kZl2lfx9yoxjno1X_8-1" vertex="1">
          <mxGeometry y="50" width="170" height="50" as="geometry" />
        </mxCell>
        <mxCell id="x4kZl2lfx9yoxjno1X_8-6" value="" style="shape=partialRectangle;overflow=hidden;connectable=0;fillColor=none;top=0;left=0;bottom=0;right=0;" parent="x4kZl2lfx9yoxjno1X_8-5" vertex="1">
          <mxGeometry width="30" height="50" as="geometry" />
        </mxCell>
        <mxCell id="x4kZl2lfx9yoxjno1X_8-7" value="id: int&#xa;authorId: string&#xa;content: string" style="shape=partialRectangle;overflow=hidden;connectable=0;fillColor=none;top=0;left=0;bottom=0;right=0;align=left;spacingLeft=6;fontStyle=1" parent="x4kZl2lfx9yoxjno1X_8-5" vertex="1">
          <mxGeometry x="30" width="140" height="50" as="geometry" />
        </mxCell>
        <mxCell id="x4kZl2lfx9yoxjno1X_8-11" value="Vote" style="shape=table;startSize=30;container=1;collapsible=1;childLayout=tableLayout;fixedRows=1;rowLines=0;fontStyle=1;align=center;resizeLast=1;" parent="1" vertex="1">
          <mxGeometry x="410" y="40" width="180" height="160" as="geometry" />
        </mxCell>
        <mxCell id="x4kZl2lfx9yoxjno1X_8-12" value="" style="shape=partialRectangle;collapsible=0;dropTarget=0;pointerEvents=0;fillColor=none;points=[[0,0.5],[1,0.5]];portConstraint=eastwest;top=0;left=0;right=0;bottom=1;" parent="x4kZl2lfx9yoxjno1X_8-11" vertex="1">
          <mxGeometry y="30" width="180" height="30" as="geometry" />
        </mxCell>
        <mxCell id="x4kZl2lfx9yoxjno1X_8-13" value="" style="shape=partialRectangle;overflow=hidden;connectable=0;fillColor=none;top=0;left=0;bottom=0;right=0;fontStyle=1;" parent="x4kZl2lfx9yoxjno1X_8-12" vertex="1">
          <mxGeometry width="30" height="30" as="geometry" />
        </mxCell>
        <mxCell id="x4kZl2lfx9yoxjno1X_8-14" value="" style="shape=partialRectangle;overflow=hidden;connectable=0;fillColor=none;top=0;left=0;bottom=0;right=0;align=left;spacingLeft=6;fontStyle=5;" parent="x4kZl2lfx9yoxjno1X_8-12" vertex="1">
          <mxGeometry x="30" width="150" height="30" as="geometry" />
        </mxCell>
        <mxCell id="x4kZl2lfx9yoxjno1X_8-15" value="" style="shape=partialRectangle;collapsible=0;dropTarget=0;pointerEvents=0;fillColor=none;points=[[0,0.5],[1,0.5]];portConstraint=eastwest;top=0;left=0;right=0;bottom=0;" parent="x4kZl2lfx9yoxjno1X_8-11" vertex="1">
          <mxGeometry y="60" width="180" height="50" as="geometry" />
        </mxCell>
        <mxCell id="x4kZl2lfx9yoxjno1X_8-16" value="" style="shape=partialRectangle;overflow=hidden;connectable=0;fillColor=none;top=0;left=0;bottom=0;right=0;" parent="x4kZl2lfx9yoxjno1X_8-15" vertex="1">
          <mxGeometry width="30" height="50" as="geometry" />
        </mxCell>
        <mxCell id="x4kZl2lfx9yoxjno1X_8-17" value="questionId: int&#xa;indice: int" style="shape=partialRectangle;overflow=hidden;connectable=0;fillColor=none;top=0;left=0;bottom=0;right=0;align=left;spacingLeft=6;fontStyle=1" parent="x4kZl2lfx9yoxjno1X_8-15" vertex="1">
          <mxGeometry x="30" width="150" height="50" as="geometry" />
        </mxCell>
        <mxCell id="dp6raFCqJ5_Mcl_TN63_-1" value="Indices :&lt;br&gt;0 : Contre&lt;br&gt;1 : HS&lt;br&gt;2 : Pour" style="rounded=0;whiteSpace=wrap;html=1;" parent="1" vertex="1">
          <mxGeometry x="640" y="95" width="120" height="60" as="geometry" />
        </mxCell>
        <mxCell id="dp6raFCqJ5_Mcl_TN63_-2" value="" style="endArrow=classic;html=1;entryX=0;entryY=0.5;entryDx=0;entryDy=0;exitX=1;exitY=0.5;exitDx=0;exitDy=0;" parent="1" source="x4kZl2lfx9yoxjno1X_8-15" target="dp6raFCqJ5_Mcl_TN63_-1" edge="1">
          <mxGeometry width="50" height="50" relative="1" as="geometry">
            <mxPoint x="400" y="340" as="sourcePoint" />
            <mxPoint x="450" y="290" as="targetPoint" />
          </mxGeometry>
        </mxCell>
        <mxCell id="dp6raFCqJ5_Mcl_TN63_-4" value="API&lt;br&gt;&lt;br&gt;Supprimer question : Delete /api/question/delete?questionId=int&lt;br&gt;Ajouter question : Put /api/question/new (Body: Question)&lt;br&gt;Ajouter vote : Put /api/vote/new (Body: Vote)&lt;br&gt;Supprimer vote : Delete /api/vote/delete (Body: Vote)&lt;br&gt;Récupérer toutes les questions : Get /api/question/get" style="rounded=0;whiteSpace=wrap;html=1;" parent="1" vertex="1">
          <mxGeometry x="70" y="270" width="580" height="110" as="geometry" />
        </mxCell>
        <mxCell id="dp6raFCqJ5_Mcl_TN63_-5" value="" style="endArrow=none;html=1;" parent="1" edge="1">
          <mxGeometry width="50" height="50" relative="1" as="geometry">
            <mxPoint y="480" as="sourcePoint" />
            <mxPoint x="830" y="480" as="targetPoint" />
          </mxGeometry>
        </mxCell>
        <mxCell id="dp6raFCqJ5_Mcl_TN63_-8" value="" style="rounded=0;whiteSpace=wrap;html=1;" parent="1" vertex="1">
          <mxGeometry x="25" y="500" width="800" height="450" as="geometry" />
        </mxCell>
        <mxCell id="dp6raFCqJ5_Mcl_TN63_-9" value="" style="endArrow=none;html=1;entryX=0.5;entryY=0;entryDx=0;entryDy=0;exitX=0.5;exitY=1;exitDx=0;exitDy=0;" parent="1" source="dp6raFCqJ5_Mcl_TN63_-8" target="dp6raFCqJ5_Mcl_TN63_-8" edge="1">
          <mxGeometry width="50" height="50" relative="1" as="geometry">
            <mxPoint x="400" y="680" as="sourcePoint" />
            <mxPoint x="450" y="630" as="targetPoint" />
          </mxGeometry>
        </mxCell>
        <mxCell id="dp6raFCqJ5_Mcl_TN63_-10" value="Questions ...." style="rounded=0;whiteSpace=wrap;html=1;" parent="1" vertex="1">
          <mxGeometry x="25" y="920" width="405" height="30" as="geometry" />
        </mxCell>
        <mxCell id="dp6raFCqJ5_Mcl_TN63_-11" value="Stack&lt;br&gt;Question 1 (UP/DOWN/HS)&lt;br&gt;Question 2&amp;nbsp;(UP/DOWN/HS)&lt;br&gt;Question 3&amp;nbsp;(UP/DOWN/HS)&lt;br&gt;Question 4&amp;nbsp;(UP/DOWN/HS)&lt;br&gt;Question 5&amp;nbsp;(UP/DOWN/HS)" style="rounded=0;whiteSpace=wrap;html=1;" parent="1" vertex="1">
          <mxGeometry x="25" y="500" width="405" height="420" as="geometry" />
        </mxCell>
        <mxCell id="dp6raFCqJ5_Mcl_TN63_-14" value="Ranking" style="rounded=0;whiteSpace=wrap;html=1;" parent="1" vertex="1">
          <mxGeometry x="430" y="500" width="400" height="450" as="geometry" />
        </mxCell>
        <mxCell id="dp6raFCqJ5_Mcl_TN63_-15" value="Trie ou filtre par UP/DOWN/HS" style="rounded=0;whiteSpace=wrap;html=1;" parent="1" vertex="1">
          <mxGeometry x="430" y="500" width="400" height="60" as="geometry" />
        </mxCell>
        <mxCell id="3Z3B4lqEo7R_Mspt_aKj-1" value="Question" style="shape=table;startSize=30;container=1;collapsible=1;childLayout=tableLayout;fixedRows=1;rowLines=0;fontStyle=1;align=center;resizeLast=1;" vertex="1" parent="1">
          <mxGeometry x="10" y="40" width="170" height="150" as="geometry" />
        </mxCell>
        <mxCell id="3Z3B4lqEo7R_Mspt_aKj-2" value="" style="shape=partialRectangle;collapsible=0;dropTarget=0;pointerEvents=0;fillColor=none;points=[[0,0.5],[1,0.5]];portConstraint=eastwest;top=0;left=0;right=0;bottom=1;" vertex="1" parent="3Z3B4lqEo7R_Mspt_aKj-1">
          <mxGeometry y="30" width="170" height="20" as="geometry" />
        </mxCell>
        <mxCell id="3Z3B4lqEo7R_Mspt_aKj-3" value="" style="shape=partialRectangle;overflow=hidden;connectable=0;fillColor=none;top=0;left=0;bottom=0;right=0;fontStyle=1;" vertex="1" parent="3Z3B4lqEo7R_Mspt_aKj-2">
          <mxGeometry width="30" height="20" as="geometry" />
        </mxCell>
        <mxCell id="3Z3B4lqEo7R_Mspt_aKj-4" value="" style="shape=partialRectangle;overflow=hidden;connectable=0;fillColor=none;top=0;left=0;bottom=0;right=0;align=left;spacingLeft=6;fontStyle=5;" vertex="1" parent="3Z3B4lqEo7R_Mspt_aKj-2">
          <mxGeometry x="30" width="140" height="20" as="geometry" />
        </mxCell>
        <mxCell id="3Z3B4lqEo7R_Mspt_aKj-5" value="" style="shape=partialRectangle;collapsible=0;dropTarget=0;pointerEvents=0;fillColor=none;points=[[0,0.5],[1,0.5]];portConstraint=eastwest;top=0;left=0;right=0;bottom=0;" vertex="1" parent="3Z3B4lqEo7R_Mspt_aKj-1">
          <mxGeometry y="50" width="170" height="90" as="geometry" />
        </mxCell>
        <mxCell id="3Z3B4lqEo7R_Mspt_aKj-6" value="" style="shape=partialRectangle;overflow=hidden;connectable=0;fillColor=none;top=0;left=0;bottom=0;right=0;" vertex="1" parent="3Z3B4lqEo7R_Mspt_aKj-5">
          <mxGeometry width="30" height="90" as="geometry" />
        </mxCell>
        <mxCell id="3Z3B4lqEo7R_Mspt_aKj-7" value="id: int&#xa;authorId: string&#xa;content: string&#xa;nbOk: int&#xa;nbKo: int&#xa;nbOff: int" style="shape=partialRectangle;overflow=hidden;connectable=0;fillColor=none;top=0;left=0;bottom=0;right=0;align=left;spacingLeft=6;fontStyle=1" vertex="1" parent="3Z3B4lqEo7R_Mspt_aKj-5">
          <mxGeometry x="30" width="140" height="90" as="geometry" />
        </mxCell>
      </root>
    </mxGraphModel>
  </diagram>
</mxfile>
