{
    "user_id" : "",
    "user_name" : "",
    "channel_id" : "",
    "private" : "False", 
    "type" : "",
    "step" : "0",
    "book" : {  
        "title" : "",
        "authors" : {},
        "date" : "",
        "categories" : {},
        "channel_id" : "",
        "description" : "",
        "img_cover" : "",
        "img_author" : "",
        "thinkerview" : "",
        "contributor" : "",
        "file" : ""
    }
}
