[gd_scene load_steps=5 format=3 uid="uid://6lfvpe1jnvns"]

[ext_resource type="Script" path="res://scripts/levels/3.gd" id="1_uvlll"]
[ext_resource type="TileSet" uid="uid://br461uhfv7uy6" path="res://assets/art/kenney/sokoban/tileset.tres" id="2_qotbm"]
[ext_resource type="PackedScene" uid="uid://b3lvl2igbda3" path="res://scenes/player.tscn" id="3_arfff"]
[ext_resource type="PackedScene" path="res://scenes/goal.tscn" id="4_r0hbr"]

[node name="Node2D" type="Node2D"]
script = ExtResource("1_uvlll")

[node name="TileMap" type="TileMap" parent="."]
tile_set = ExtResource("2_qotbm")
cell_quadrant_size = 64
format = 2
layer_0/tile_data = PackedInt32Array(-917527, 3, 0, 1048553, 3, 0, 983065, 3, 0, -851991, 3, 0, -786455, 3, 0, -720919, 3, 0, -655383, 3, 0, -589847, 3, 0, -524311, 3, 0, -458775, 3, 0, -393239, 3, 0, -327703, 3, 0, -262167, 3, 0, -196631, 3, 0, -131095, 3, 0, -65559, 3, 0, 720873, 3, 0, -23, 3, 0, 917481, 3, 0, 851945, 3, 0, 786409, 3, 0, 655337, 3, 0, 589801, 3, 0, 524265, 3, 0, 458729, 3, 0, 393193, 3, 0, 327657, 3, 0, 262121, 3, 0, 196585, 3, 0, 131049, 3, 0, 65513, 3, 0, 983017, 3, 0, -917479, 3, 0, -851943, 3, 0, -786407, 3, 0, -720871, 3, 0, -655335, 3, 0, -589799, 3, 0, -524263, 3, 0, -458727, 3, 0, -393191, 3, 0, -327655, 3, 0, -262119, 3, 0, -196583, 3, 0, -131047, 3, 0, -65511, 3, 0, 25, 3, 0, 65561, 3, 0, 131097, 3, 0, 196633, 3, 0, 262169, 3, 0, 327705, 3, 0, 393241, 3, 0, 458777, 3, 0, 524313, 3, 0, 589849, 3, 0, 655385, 3, 0, 720921, 3, 0, 786457, 3, 0, 851993, 3, 0, 917529, 3, 0, -983063, 3, 0, -1048599, 3, 0, -1048598, 3, 0, -1048597, 3, 0, -1048596, 3, 0, -1048595, 3, 0, -1048594, 3, 0, -1048593, 3, 0, -1048592, 3, 0, -1048591, 3, 0, -1048590, 3, 0, -1048589, 3, 0, -1048588, 3, 0, -1048587, 3, 0, -1048586, 3, 0, -1048585, 3, 0, -1048584, 3, 0, -1048583, 3, 0, -1048582, 3, 0, -1048581, 3, 0, -1048580, 3, 0, -1048579, 3, 0, -1048578, 3, 0, -1048577, 3, 0, -1114112, 3, 0, -1114111, 3, 0, -1114110, 3, 0, -1114109, 3, 0, -1114108, 3, 0, -1114107, 3, 0, -1114106, 3, 0, -1114105, 3, 0, -1114104, 3, 0, -1114103, 3, 0, -1114102, 3, 0, -1114101, 3, 0, -1114100, 3, 0, -1114099, 3, 0, -1114098, 3, 0, -1114097, 3, 0, -1114096, 3, 0, -1114095, 3, 0, -1114094, 3, 0, -1114093, 3, 0, -1114092, 3, 0, -1114091, 3, 0, -1114090, 3, 0, -1114089, 3, 0, -1114088, 3, 0, -1114087, 3, 0, 1114089, 3, 0, 1179625, 3, 0, 1179626, 3, 0, 1179627, 3, 0, 1179628, 3, 0, 1179629, 3, 0, 1179630, 3, 0, 1179631, 3, 0, 1179632, 3, 0, 1179633, 3, 0, 1179634, 3, 0, 1179635, 3, 0, 1179636, 3, 0, 1179637, 3, 0, 1179638, 3, 0, 1179639, 3, 0, 1179640, 3, 0, 1179641, 3, 0, 1179642, 3, 0, 1179643, 3, 0, 1179644, 3, 0, 1179645, 3, 0, 1179646, 3, 0, 1179647, 3, 0, 1114112, 3, 0, 1114113, 3, 0, 1114114, 3, 0, 1114115, 3, 0, 1114116, 3, 0, 1114117, 3, 0, 1114118, 3, 0, 1114119, 3, 0, 1114120, 3, 0, 1114121, 3, 0, 1114122, 3, 0, 1114123, 3, 0, 1114124, 3, 0, 1114125, 3, 0, 1114126, 3, 0, 1114127, 3, 0, 1114128, 3, 0, 1114129, 3, 0, 1114130, 3, 0, 1114131, 3, 0, 1114132, 3, 0, 1114133, 3, 0, 1114134, 3, 0, 1114135, 3, 0, 1114136, 3, 0, 1114137, 3, 0, 1048601, 3, 0, -983015, 3, 0, -1048551, 3, 0, 12, 3, 0, 131084, 2, 0, -131059, 2, 0, 13, 2, 0, -131058, 2, 0, -65523, 3, 0, 65549, 3, 0, 131085, 2, 0, -262130, 2, 0, -65522, 3, 0, 14, 2, 0, 65550, 2, 0, 131086, 2, 0, 196622, 3, 0, 262158, 2, 0, -262129, 2, 0, -196593, 3, 0, -131057, 2, 0, -65521, 2, 0, 15, 2, 0, 65551, 3, 0, 131087, 3, 0, 262159, 2, 0, -327664, 3, 0, -262128, 2, 0, -196592, 2, 0, -131056, 3, 0, 16, 2, 0, 65552, 2, 0, 131088, 2, 0, 196624, 2, 0, 262160, 2, 0, 327696, 2, 0, -262127, 3, 0, -196591, 2, 0, -131055, 2, 0, -65519, 2, 0, 17, 2, 0, 65553, 3, 0, 131089, 3, 0, 262161, 3, 0, 327697, 2, 0, -196590, 3, 0, -131054, 2, 0, -65518, 3, 0, 18, 2, 0, 65554, 2, 0, 131090, 2, 0, 196626, 3, 0, 262162, 2, 0, 327698, 2, 0, -262125, 2, 0, -196589, 2, 0, -131053, 2, 0, -65517, 2, 0, 19, 2, 0, 65555, 3, 0, 131091, 2, 0, 196627, 2, 0, 262163, 2, 0, 327699, 3, 0, -131052, 2, 0, 20, 3, 0, -131051, 2, 0, -65551, 3, 0, 196593, 3, 0, 65523, 3, 0, 65519, 3, 0, 65520, 2, 0, 65521, 2, 0, 65522, 2, 0, 131057, 2, 0, -15, 2, 0, -11, 3, 0, 65524, 2, 0, 131060, 2, 0, -12, 2, 0, 327666, 3, 0, 262129, 2, 0, 262130, 2, 0, 262131, 2, 0, 196594, 2, 0, 131058, 2, 0, -65550, 2, 0, -14, 2, 0, -131086, 2, 0, -196622, 3, 0, -13, 2, 0, -16, 2, 0, -17, 2, 0, -18, 3, 0, 131062, 3, 0, 131059, 2, 0, 131061, 2, 0, 131056, 2, 0, 131055, 2, 0, 131054, 2, 0, 131053, 3, 0, 65517, 2, 0, 65518, 2, 0, 196590, 2, 0, 262126, 2, 0, 65516, 2, 0, 65515, 3, 0, -65553, 2, 0, -131089, 2, 0, 262122, 2, 0, 262123, 2, 0, 262124, 2, 0, 262125, 2, 0, 262127, 2, 0, 262128, 2, 0, 327658, 2, 0, 393194, 2, 0, 458730, 2, 0, 196586, 2, 0, 131050, 2, 0, 65514, 2, 0, -22, 2, 0, -65558, 2, 0, -131094, 2, 0, -196630, 2, 0, -262166, 2, 0, -327702, 2, 0, -393238, 2, 0, -458774, 2, 0, -524310, 2, 0, 524266, 2, 0, 589802, 2, 0, 655338, 2, 0, 196592, 2, 0, 327664, 2, 0, 393200, 2, 0, 458736, 2, 0, 524272, 2, 0, 589808, 3, 0, -131088, 3, 0, -131079, 3, 0, -131087, 2, 0, -196623, 2, 0, -262159, 2, 0, -327695, 2, 0, -131085, 2, 0, -131084, 2, 0, -131083, 2, 0, -131082, 2, 0, -131081, 2, 0, -131080, 2, 0, -393231, 3, 0, 851946, 3, 0, 983018, 3, 0, -786451, 3, 0, -196627, 3, 0, 917485, 3, 0, 983021, 3, 0, -589842, 3, 0, -65554, 3, 0, -458769, 3, 0, -851984, 3, 0, -720912, 3, 0, 655344, 3, 0, 720880, 3, 0, 917488, 3, 0, -720911, 3, 0, -589838, 3, 0, -458766, 3, 0, 786418, 3, 0, 983026, 3, 0, -393229, 3, 0, -983051, 3, 0, 65525, 3, 0, -655370, 3, 0, -786440, 3, 0, -458760, 3, 0, 327672, 3, 0, 983032, 3, 0, -917511, 3, 0, 786425, 3, 0, -917510, 3, 0, -851974, 3, 0, -393222, 3, 0, -65542, 3, 0, 327674, 3, 0, 393210, 3, 0, 851962, 3, 0, 1114106, 3, 0, -393220, 3, 0, 196604, 3, 0, -917507, 3, 0, -655363, 3, 0, 393213, 3, 0, -851970, 3, 0, 1114110, 3, 0, -131073, 3, 0, 65536, 3, 0, 983040, 3, 0, -524287, 3, 0, 131073, 3, 0, 327681, 3, 0, 655361, 3, 0, 917505, 3, 0, -655358, 3, 0, 2, 3, 0, 393218, 3, 0, -983037, 3, 0, -327677, 3, 0, 458755, 3, 0, 786435, 3, 0, -983035, 3, 0, -458747, 3, 0, -196603, 3, 0, 196613, 3, 0, -327674, 3, 0, 1048583, 3, 0, -655352, 3, 0, 196616, 3, 0, 655369, 3, 0, 851977, 3, 0, -917494, 3, 0, -589814, 3, 0, -327670, 3, 0, 10, 3, 0, 786442, 3, 0, -1048565, 3, 0, -131061, 3, 0, 983051, 3, 0, 327692, 3, 0, 720908, 3, 0, 917516, 3, 0, -458739, 3, 0, 655373, 3, 0, 720909, 3, 0, 851981, 3, 0, 917517, 3, 0, -393202, 3, 0, 851982, 3, 0, 1048590, 3, 0, -983025, 3, 0, -720881, 3, 0, -393201, 3, 0, 1048591, 3, 0, -983023, 3, 0, 655377, 3, 0, 983057, 3, 0, -720878, 3, 0, 393234, 3, 0, 458770, 3, 0, -851949, 3, 0, -393197, 3, 0, 917523, 3, 0, 983059, 3, 0, -1048556, 3, 0, -327659, 3, 0, -1048554, 3, 0, 851990, 3, 0, -262120, 3, 0, -131048, 3, 0, 65560, 3, 0, -851990, 3, 0, -589845, 3, 0, 131051, 3, 0, 524268, 3, 0, -983059, 3, 0, -720915, 3, 0, 196589, 3, 0, -458770, 3, 0, 786414, 3, 0, 851950, 3, 0, 983024, 3, 0, -983055, 3, 0, -983054, 3, 0, 393203, 3, 0, -196620, 3, 0, 393204, 3, 0, 458742, 3, 0, 524278, 3, 0, -655369, 3, 0, -9, 3, 0, 65527, 3, 0, -983048, 3, 0, -851976, 3, 0, -393224, 3, 0, 262136, 3, 0, 393208, 3, 0, -786438, 3, 0, 65530, 3, 0, -262149, 3, 0, 524283, 3, 0, -655364, 3, 0, 720892, 3, 0, 786428, 3, 0, 1114108, 3, 0, -524291, 3, 0, 655357, 3, 0, -655362, 3, 0, 65534, 3, 0, 131070, 3, 0, 458750, 3, 0, 524286, 3, 0, 786430, 3, 0, 983038, 3, 0, -983041, 3, 0, -655361, 3, 0, 131071, 3, 0, -851968, 3, 0, -458752, 3, 0, -393216, 3, 0, -327680, 3, 0, -65536, 3, 0, 0, 3, 0, 131072, 3, 0, 524288, 3, 0, -851967, 3, 0, 524289, 3, 0, -1048574, 3, 0, -196606, 3, 0, -786429, 3, 0, 65540, 3, 0, 524292, 3, 0, -327675, 3, 0, 589829, 3, 0, 655365, 3, 0, 851973, 3, 0, -131066, 3, 0, -65530, 3, 0, -1048569, 3, 0, -786425, 3, 0, -655353, 3, 0, -327673, 3, 0, 524295, 3, 0, 720903, 3, 0, 786439, 3, 0, -589816, 3, 0, 262152, 3, 0, 917512, 3, 0, -851959, 3, 0, 720905, 3, 0, 786441, 3, 0, -1048566, 3, 0, -983030, 3, 0, -196598, 3, 0, 983050, 3, 0, 1048586, 3, 0, -983029, 3, 0, -393205, 3, 0, 1048587, 3, 0, -786420, 3, 0, 524300, 3, 0, -1048563, 3, 0, -720883, 3, 0, -196595, 3, 0, 196621, 3, 0, 983053, 3, 0, -1048561, 3, 0, -393200, 3, 0, 393232, 3, 0, -720879, 3, 0, 196625, 3, 0, 589841, 3, 0, 786449, 3, 0, 917521, 3, 0, 786450, 3, 0, -589805, 3, 0, -327661, 3, 0, 393235, 3, 0, 524307, 3, 0, 589844, 3, 0, 720916, 3, 0, -1048555, 3, 0, -851947, 3, 0, 393237, 3, 0, 786453, 3, 0, 917525, 3, 0, -196586, 3, 0, 131094, 3, 0, 589846, 3, 0, -262121, 3, 0, 1048599, 3, 0, -917480, 3, 0, -917526, 3, 0, 1114090, 3, 0, -393237, 3, 0, -851988, 3, 0, -458772, 3, 0, -65556, 3, 0, 393196, 3, 0, -19, 3, 0, 327661, 3, 0, 393197, 3, 0, -983058, 3, 0, 524270, 3, 0, -983057, 3, 0, 327663, 3, 0, -983056, 3, 0, -655376, 3, 0, -65552, 3, 0, 851952, 3, 0, 1114096, 3, 0, 589809, 3, 0, 720881, 3, 0, 1048561, 3, 0, 458738, 3, 0, -786445, 3, 0, 458740, 3, 0, 720884, 3, 0, 786420, 3, 0, -262155, 3, 0, 262133, 3, 0, 458741, 3, 0, -786442, 3, 0, 786422, 3, 0, 131063, 3, 0, 393207, 3, 0, 655351, 3, 0, 917495, 3, 0, -196616, 3, 0, 458744, 3, 0, 589816, 3, 0, 1114104, 3, 0, -983047, 3, 0, -720903, 3, 0, -327687, 3, 0, -196615, 3, 0, 655353, 3, 0, -262150, 3, 0, 589819, 3, 0, -851972, 3, 0, -327683, 3, 0, -196610, 3, 0, 720895, 3, 0, 917504, 3, 0, -917502, 3, 0, -262142, 3, 0, 655362, 3, 0, 983042, 3, 0, -458748, 3, 0, -196604, 3, 0, 589828, 3, 0, 720900, 3, 0, 851972, 3, 0, 131077, 3, 0, -786426, 3, 0, -196602, 3, 0, -196601, 3, 0, -65529, 3, 0, 1048584, 3, 0, -589815, 3, 0, -262134, 3, 0, 65546, 3, 0, 524298, 3, 0, 131083, 3, 0, -851956, 3, 0, 262156, 3, 0, -983026, 3, 0, -917490, 3, 0, -720882, 3, 0, -524273, 3, 0, -327665, 3, 0, -720880, 3, 0, -589808, 3, 0, -524272, 3, 0, 720912, 3, 0, -589807, 3, 0, -458735, 3, 0, 851986, 3, 0, 917522, 3, 0, -720876, 3, 0, -524268, 3, 0, -589803, 3, 0, 131093, 3, 0, 262165, 3, 0, -524266, 3, 0, 65558, 3, 0, 524310, 3, 0, 23, 3, 0, 786455, 3, 0, 131096, 3, 0, 327704, 3, 0, 393240, 3, 0, -983062, 2, 0, -786454, 2, 0, -720918, 2, 0, -655382, 2, 0, -589846, 2, 0, 720874, 2, 0, 786410, 2, 0, 917482, 2, 0, 1048554, 2, 0, -983061, 2, 0, -917525, 2, 0, -851989, 2, 0, -786453, 2, 0, -720917, 2, 0, -655381, 2, 0, -524309, 2, 0, -458773, 2, 0, -327701, 2, 0, -262165, 2, 0, -196629, 2, 0, -131093, 2, 0, -65557, 2, 0, -21, 2, 0, 196587, 2, 0, 327659, 2, 0, 393195, 2, 0, 458731, 2, 0, 524267, 2, 0, 589803, 2, 0, 655339, 2, 0, 720875, 2, 0, 786411, 2, 0, 851947, 2, 0, 917483, 2, 0, 983019, 2, 0, 1048555, 2, 0, 1114091, 2, 0, -983060, 2, 0, -917524, 2, 0, -786452, 2, 0, -720916, 2, 0, -655380, 2, 0, -589844, 2, 0, -524308, 2, 0, -393236, 2, 0, -327700, 2, 0, -262164, 2, 0, -196628, 2, 0, -131092, 2, 0, -20, 2, 0, 131052, 2, 0, 196588, 2, 0, 327660, 2, 0, 458732, 2, 0, 589804, 2, 0, 655340, 2, 0, 720876, 2, 0, 786412, 2, 0, 851948, 2, 0, 917484, 2, 0, 983020, 2, 0, 1048556, 2, 0, 1114092, 2, 0, -917523, 2, 0, -851987, 2, 0, -655379, 2, 0, -589843, 2, 0, -524307, 2, 0, -458771, 2, 0, -393235, 2, 0, -327699, 2, 0, -262163, 2, 0, -131091, 2, 0, -65555, 2, 0, 458733, 2, 0, 524269, 2, 0, 589805, 2, 0, 655341, 2, 0, 720877, 2, 0, 786413, 2, 0, 851949, 2, 0, 1048557, 2, 0, 1114093, 2, 0, -917522, 2, 0, -851986, 2, 0, -786450, 2, 0, -720914, 2, 0, -655378, 2, 0, -524306, 2, 0, -393234, 2, 0, -327698, 2, 0, -262162, 2, 0, -196626, 2, 0, -131090, 2, 0, 327662, 2, 0, 393198, 2, 0, 458734, 2, 0, 589806, 2, 0, 655342, 2, 0, 720878, 2, 0, 917486, 2, 0, 983022, 2, 0, 1048558, 2, 0, 1114094, 2, 0, -917521, 2, 0, -851985, 2, 0, -786449, 2, 0, -720913, 2, 0, -655377, 2, 0, -589841, 2, 0, -524305, 2, 0, -393233, 2, 0, -327697, 2, 0, -262161, 2, 0, -196625, 2, 0, 196591, 2, 0, 393199, 2, 0, 458735, 2, 0, 524271, 2, 0, 589807, 2, 0, 655343, 2, 0, 720879, 2, 0, 786415, 2, 0, 851951, 2, 0, 917487, 2, 0, 983023, 2, 0, 1048559, 2, 0, 1114095, 2, 0, -917520, 2, 0, -786448, 2, 0, -589840, 2, 0, -524304, 2, 0, -458768, 2, 0, -393232, 2, 0, -327696, 2, 0, -262160, 2, 0, -196624, 2, 0, 786416, 2, 0, 1048560, 2, 0, -917519, 2, 0, -851983, 2, 0, -786447, 2, 0, -655375, 2, 0, -589839, 2, 0, -524303, 2, 0, -458767, 2, 0, 327665, 2, 0, 393201, 2, 0, 458737, 2, 0, 524273, 2, 0, 655345, 2, 0, 786417, 2, 0, 851953, 2, 0, 917489, 2, 0, 983025, 2, 0, 1114097, 2, 0, -917518, 2, 0, -851982, 2, 0, -786446, 2, 0, -720910, 2, 0, -655374, 2, 0, -524302, 2, 0, -393230, 2, 0, -327694, 2, 0, -262158, 2, 0, 393202, 2, 0, 524274, 2, 0, 589810, 2, 0, 655346, 2, 0, 720882, 2, 0, 851954, 2, 0, 917490, 2, 0, 1048562, 2, 0, 1114098, 2, 0, -983053, 2, 0, -917517, 2, 0, -851981, 2, 0, -720909, 2, 0, -655373, 2, 0, -589837, 2, 0, -524301, 2, 0, -458765, 2, 0, -327693, 2, 0, -262157, 2, 0, -196621, 2, 0, -65549, 2, 0, 196595, 2, 0, 327667, 2, 0, 458739, 2, 0, 524275, 2, 0, 589811, 2, 0, 655347, 2, 0, 720883, 2, 0, 786419, 2, 0, 851955, 2, 0, 917491, 2, 0, 983027, 2, 0, 1048563, 2, 0, 1114099, 2, 0, -983052, 2, 0, -917516, 2, 0, -851980, 2, 0, -786444, 2, 0, -720908, 2, 0, -655372, 2, 0, -589836, 2, 0, -524300, 2, 0, -458764, 2, 0, -393228, 2, 0, -327692, 2, 0, -262156, 2, 0, -65548, 2, 0, 196596, 2, 0, 262132, 2, 0, 327668, 2, 0, 524276, 2, 0, 589812, 2, 0, 655348, 2, 0, 851956, 2, 0, 917492, 2, 0, 983028, 2, 0, 1048564, 2, 0, 1114100, 2, 0, -917515, 2, 0, -851979, 2, 0, -786443, 2, 0, -720907, 2, 0, -655371, 2, 0, -589835, 2, 0, -524299, 2, 0, -458763, 2, 0, -393227, 2, 0, -327691, 2, 0, -196619, 2, 0, -65547, 2, 0, 196597, 2, 0, 327669, 2, 0, 393205, 2, 0, 524277, 2, 0, 589813, 2, 0, 655349, 2, 0, 720885, 2, 0, 786421, 2, 0, 851957, 2, 0, 917493, 2, 0, 983029, 2, 0, 1048565, 2, 0, 1114101, 2, 0, -983050, 2, 0, -917514, 2, 0, -851978, 2, 0, -720906, 2, 0, -589834, 2, 0, -524298, 2, 0, -458762, 2, 0, -393226, 2, 0, -327690, 2, 0, -262154, 2, 0, -196618, 2, 0, -65546, 2, 0, -10, 2, 0, 65526, 2, 0, 196598, 2, 0, 262134, 2, 0, 327670, 2, 0, 393206, 2, 0, 589814, 2, 0, 655350, 2, 0, 720886, 2, 0, 851958, 2, 0, 917494, 2, 0, 983030, 2, 0, 1048566, 2, 0, 1114102, 2, 0, -983049, 2, 0, -917513, 2, 0, -851977, 2, 0, -786441, 2, 0, -720905, 2, 0, -589833, 2, 0, -524297, 2, 0, -458761, 2, 0, -393225, 2, 0, -327689, 2, 0, -262153, 2, 0, -196617, 2, 0, -65545, 2, 0, 196599, 2, 0, 262135, 2, 0, 327671, 2, 0, 458743, 2, 0, 524279, 2, 0, 589815, 2, 0, 720887, 2, 0, 786423, 2, 0, 851959, 2, 0, 983031, 2, 0, 1048567, 2, 0, 1114103, 2, 0, -917512, 2, 0, -720904, 2, 0, -655368, 2, 0, -589832, 2, 0, -524296, 2, 0, -327688, 2, 0, -262152, 2, 0, -65544, 2, 0, -8, 2, 0, 65528, 2, 0, 131064, 2, 0, 196600, 2, 0, 524280, 2, 0, 655352, 2, 0, 720888, 2, 0, 786424, 2, 0, 851960, 2, 0, 917496, 2, 0, 1048568, 2, 0, -851975, 2, 0, -786439, 2, 0, -655367, 2, 0, -589831, 2, 0, -524295, 2, 0, -458759, 2, 0, -393223, 2, 0, -262151, 2, 0, -65543, 2, 0, -7, 2, 0, 65529, 2, 0, 131065, 2, 0, 196601, 2, 0, 262137, 2, 0, 327673, 2, 0, 393209, 2, 0, 458745, 2, 0, 524281, 2, 0, 589817, 2, 0, 720889, 2, 0, 851961, 2, 0, 917497, 2, 0, 983033, 2, 0, 1048569, 2, 0, 1114105, 2, 0, -983046, 3, 0, -720902, 2, 0, -655366, 2, 0, -589830, 2, 0, -524294, 2, 0, -458758, 2, 0, -327686, 2, 0, -196614, 2, 0, -131078, 2, 0, -6, 2, 0, 131066, 2, 0, 196602, 2, 0, 262138, 2, 0, 458746, 2, 0, 524282, 2, 0, 589818, 2, 0, 655354, 2, 0, 720890, 2, 0, 786426, 2, 0, 917498, 2, 0, 983034, 2, 0, 1048570, 2, 0, -983045, 2, 0, -917509, 2, 0, -851973, 2, 0, -786437, 2, 0, -720901, 2, 0, -655365, 2, 0, -589829, 2, 0, -524293, 2, 0, -458757, 2, 0, -393221, 2, 0, -327685, 2, 0, -196613, 2, 0, -131077, 2, 0, -65541, 2, 0, -5, 2, 0, 65531, 2, 0, 131067, 2, 0, 196603, 2, 0, 262139, 2, 0, 327675, 2, 0, 393211, 2, 0, 458747, 2, 0, 655355, 2, 0, 720891, 2, 0, 786427, 2, 0, 851963, 2, 0, 917499, 2, 0, 983035, 2, 0, 1048571, 2, 0, 1114107, 2, 0, -983044, 2, 0, -917508, 2, 0, -786436, 2, 0, -720900, 2, 0, -589828, 2, 0, -524292, 2, 0, -458756, 2, 0, -327684, 2, 0, -262148, 2, 0, -196612, 2, 0, -131076, 2, 0, -65540, 2, 0, -4, 2, 0, 65532, 2, 0, 131068, 2, 0, 262140, 2, 0, 327676, 2, 0, 393212, 2, 0, 458748, 2, 0, 524284, 2, 0, 589820, 2, 0, 655356, 2, 0, 851964, 2, 0, 917500, 2, 0, 983036, 2, 0, 1048572, 2, 0, -983043, 2, 0, -851971, 2, 0, -786435, 2, 0, -720899, 2, 0, -589827, 2, 0, -458755, 2, 0, -393219, 2, 0, -262147, 2, 0, -196611, 2, 0, -131075, 2, 0, -65539, 2, 0, -3, 2, 0, 65533, 2, 0, 131069, 2, 0, 196605, 2, 0, 262141, 2, 0, 327677, 2, 0, 458749, 2, 0, 524285, 2, 0, 589821, 2, 0, 720893, 2, 0, 786429, 2, 0, 851965, 2, 0, 917501, 2, 0, 983037, 2, 0, 1048573, 2, 0, 1114109, 2, 0, -983042, 2, 0, -917506, 2, 0, -786434, 2, 0, -720898, 2, 0, -589826, 2, 0, -524290, 2, 0, -458754, 2, 0, -393218, 2, 0, -327682, 2, 0, -262146, 2, 0, -131074, 2, 0, -65538, 2, 0, -2, 2, 0, 196606, 2, 0, 262142, 2, 0, 327678, 2, 0, 393214, 2, 0, 589822, 2, 0, 655358, 2, 0, 720894, 2, 0, 851966, 2, 0, 917502, 2, 0, 1048574, 2, 0, -917505, 2, 0, -851969, 2, 0, -786433, 2, 0, -720897, 2, 0, -589825, 2, 0, -524289, 2, 0, -458753, 2, 0, -393217, 2, 0, -327681, 2, 0, -262145, 2, 0, -196609, 2, 0, -65537, 2, 0, -1, 2, 0, 65535, 2, 0, 196607, 2, 0, 262143, 2, 0, 327679, 2, 0, 393215, 2, 0, 458751, 2, 0, 524287, 2, 0, 589823, 2, 0, 655359, 2, 0, 786431, 2, 0, 851967, 2, 0, 917503, 2, 0, 983039, 2, 0, 1048575, 2, 0, 1114111, 2, 0, -1048576, 2, 0, -983040, 2, 0, -917504, 2, 0, -786432, 2, 0, -720896, 2, 0, -655360, 2, 0, -589824, 2, 0, -524288, 2, 0, -262144, 2, 0, -196608, 2, 0, -131072, 2, 0, 196608, 2, 0, 262144, 2, 0, 327680, 2, 0, 393216, 2, 0, 458752, 2, 0, 589824, 2, 0, 655360, 2, 0, 720896, 2, 0, 786432, 2, 0, 851968, 2, 0, 1048576, 2, 0, -1048575, 2, 0, -983039, 2, 0, -917503, 2, 0, -786431, 2, 0, -720895, 2, 0, -655359, 2, 0, -589823, 2, 0, -458751, 2, 0, -393215, 2, 0, -327679, 2, 0, -262143, 2, 0, -196607, 2, 0, -131071, 2, 0, -65535, 2, 0, 1, 2, 0, 65537, 2, 0, 196609, 2, 0, 262145, 2, 0, 393217, 2, 0, 458753, 2, 0, 589825, 2, 0, 720897, 2, 0, 786433, 2, 0, 851969, 2, 0, 983041, 2, 0, 1048577, 2, 0, -983038, 2, 0, -851966, 2, 0, -786430, 2, 0, -720894, 2, 0, -589822, 2, 0, -524286, 2, 0, -458750, 2, 0, -393214, 2, 0, -327678, 2, 0, -131070, 2, 0, -65534, 2, 0, 65538, 2, 0, 131074, 2, 0, 196610, 2, 0, 262146, 2, 0, 327682, 2, 0, 458754, 2, 0, 524290, 2, 0, 589826, 2, 0, 720898, 2, 0, 786434, 2, 0, 851970, 2, 0, 917506, 2, 0, 1048578, 2, 0, -1048573, 2, 0, -917501, 2, 0, -851965, 2, 0, -720893, 2, 0, -655357, 2, 0, -589821, 2, 0, -524285, 2, 0, -458749, 2, 0, -393213, 2, 0, -262141, 2, 0, -196605, 2, 0, -131069, 2, 0, -65533, 2, 0, 3, 2, 0, 65539, 2, 0, 131075, 2, 0, 196611, 2, 0, 262147, 2, 0, 327683, 2, 0, 393219, 2, 0, 524291, 2, 0, 589827, 2, 0, 655363, 2, 0, 720899, 2, 0, 851971, 2, 0, 917507, 2, 0, 983043, 2, 0, 1048579, 2, 0, -1048572, 2, 0, -983036, 2, 0, -917500, 2, 0, -851964, 2, 0, -786428, 2, 0, -720892, 2, 0, -655356, 2, 0, -589820, 2, 0, -524284, 2, 0, -393212, 2, 0, -327676, 2, 0, -262140, 2, 0, -131068, 2, 0, -65532, 2, 0, 4, 3, 0, 131076, 2, 0, 196612, 2, 0, 262148, 2, 0, 327684, 2, 0, 393220, 2, 0, 458756, 2, 0, 655364, 2, 0, 786436, 2, 0, 917508, 2, 0, 983044, 2, 0, 1048580, 2, 0, -1048571, 2, 0, -917499, 2, 0, -851963, 2, 0, -786427, 2, 0, -720891, 2, 0, -655355, 2, 0, -589819, 2, 0, -524283, 2, 0, -393211, 2, 0, -262139, 2, 0, -131067, 2, 0, -65531, 2, 0, 5, 2, 0, 65541, 2, 0, 262149, 2, 0, 327685, 2, 0, 393221, 2, 0, 458757, 2, 0, 524293, 2, 0, 720901, 2, 0, 786437, 2, 0, 917509, 2, 0, 983045, 2, 0, 1048581, 2, 0, -1048570, 2, 0, -983034, 2, 0, -917498, 2, 0, -851962, 2, 0, -720890, 2, 0, -655354, 2, 0, -589818, 3, 0, -524282, 2, 0, -458746, 2, 0, -393210, 2, 0, -262138, 2, 0, 6, 2, 0, 65542, 3, 0, 131078, 2, 0, 196614, 2, 0, 262150, 2, 0, 327686, 3, 0, 393222, 2, 0, 458758, 2, 0, 524294, 2, 0, 589830, 2, 0, 655366, 2, 0, 720902, 2, 0, 786438, 2, 0, 851974, 2, 0, 917510, 2, 0, 983046, 2, 0, 1048582, 2, 0, -983033, 2, 0, -917497, 2, 0, -851961, 2, 0, -720889, 2, 0, -589817, 2, 0, -524281, 2, 0, -458745, 2, 0, -393209, 2, 0, -262137, 2, 0, -131065, 2, 0, 7, 2, 0, 65543, 2, 0, 131079, 3, 0, 196615, 2, 0, 262151, 2, 0, 327687, 2, 0, 393223, 3, 0, 458759, 2, 0, 589831, 2, 0, 655367, 2, 0, 917511, 2, 0, 983047, 2, 0, -1048568, 2, 0, -983032, 2, 0, -917496, 2, 0, -851960, 2, 0, -786424, 2, 0, -720888, 2, 0, -524280, 2, 0, -458744, 2, 0, -393208, 2, 0, -327672, 2, 0, -262136, 2, 0, -196600, 2, 0, -131064, 2, 0, -65528, 2, 0, 8, 2, 0, 65544, 2, 0, 131080, 2, 0, 327688, 3, 0, 393224, 2, 0, 458760, 2, 0, 524296, 2, 0, 589832, 2, 0, 655368, 2, 0, 720904, 2, 0, 786440, 2, 0, 851976, 2, 0, 983048, 2, 0, -1048567, 2, 0, -983031, 2, 0, -917495, 2, 0, -786423, 2, 0, -720887, 2, 0, -655351, 2, 0, -524279, 2, 0, -458743, 3, 0, -393207, 2, 0, -327671, 2, 0, -262135, 2, 0, -196599, 2, 0, -131063, 2, 0, -65527, 2, 0, 9, 2, 0, 65545, 2, 0, 131081, 2, 0, 196617, 2, 0, 262153, 2, 0, 327689, 2, 0, 393225, 2, 0, 458761, 3, 0, 524297, 2, 0, 589833, 2, 0, 917513, 2, 0, 983049, 2, 0, 1048585, 2, 0, -851958, 2, 0, -786422, 2, 0, -720886, 2, 0, -655350, 2, 0, -524278, 3, 0, -458742, 2, 0, -393206, 2, 0, -131062, 2, 0, -65526, 2, 0, 131082, 2, 0, 196618, 2, 0, 262154, 2, 0, 327690, 2, 0, 393226, 2, 0, 458762, 2, 0, 589834, 2, 0, 655370, 2, 0, 720906, 2, 0, 851978, 2, 0, 917514, 2, 0, -917493, 2, 0, -851957, 2, 0, -786421, 2, 0, -720885, 2, 0, -655349, 2, 0, -589813, 2, 0, -524277, 2, 0, -458741, 2, 0, -327669, 2, 0, -262133, 2, 0, -196597, 2, 0, -65525, 2, 0, 11, 2, 0, 65547, 2, 0, 196619, 2, 0, 262155, 2, 0, 327691, 2, 0, 393227, 2, 0, 458763, 2, 0, 524299, 2, 0, 589835, 2, 0, 655371, 2, 0, 720907, 2, 0, 786443, 2, 0, 851979, 2, 0, 917515, 2, 0, -1048564, 2, 0, -983028, 2, 0, -917492, 2, 0, -720884, 2, 0, -655348, 2, 0, -589812, 2, 0, -524276, 3, 0, -458740, 2, 0, -393204, 2, 0, -327668, 2, 0, -262132, 3, 0, -196596, 2, 0, -131060, 2, 0, -65524, 2, 0, 65548, 2, 0, 196620, 2, 0, 393228, 2, 0, 458764, 2, 0, 589836, 2, 0, 655372, 2, 0, 786444, 2, 0, 851980, 2, 0, 983052, 2, 0, 1048588, 2, 0, -983027, 2, 0, -917491, 2, 0, -851955, 2, 0, -786419, 2, 0, -655347, 2, 0, -589811, 2, 0, -524275, 2, 0, -393203, 2, 0, -327667, 2, 0, -262131, 2, 0, 262157, 2, 0, 327693, 2, 0, 393229, 2, 0, 458765, 2, 0, 524301, 2, 0, 589837, 3, 0, 786445, 2, 0, 1048589, 2, 0, -1048562, 2, 0, -851954, 2, 0, -786418, 2, 0, -655346, 2, 0, -589810, 2, 0, -524274, 2, 0, -458738, 2, 0, -327666, 2, 0, -196594, 2, 0, 327694, 2, 0, 393230, 2, 0, 458766, 2, 0, 524302, 2, 0, 589838, 2, 0, 655374, 2, 0, 720910, 2, 0, 786446, 2, 0, 917518, 2, 0, 983054, 2, 0, -917489, 2, 0, -851953, 2, 0, -786417, 2, 0, -655345, 2, 0, -589809, 2, 0, -458737, 2, 0, 196623, 2, 0, 327695, 3, 0, 393231, 2, 0, 458767, 3, 0, 524303, 2, 0, 589839, 2, 0, 655375, 2, 0, 720911, 2, 0, 786447, 2, 0, 851983, 2, 0, 917519, 2, 0, 983055, 2, 0, -1048560, 2, 0, -983024, 2, 0, -917488, 2, 0, -851952, 2, 0, -786416, 2, 0, -655344, 2, 0, -458736, 2, 0, -65520, 2, 0, 458768, 2, 0, 524304, 2, 0, 589840, 2, 0, 655376, 2, 0, 786448, 2, 0, 851984, 2, 0, 917520, 2, 0, 983056, 2, 0, 1048592, 2, 0, -1048559, 2, 0, -917487, 2, 0, -851951, 2, 0, -786415, 2, 0, -655343, 2, 0, -524271, 2, 0, -393199, 2, 0, -327663, 2, 0, 393233, 2, 0, 458769, 2, 0, 524305, 2, 0, 720913, 2, 0, 851985, 2, 0, 1048593, 2, 0, -1048558, 2, 0, -983022, 2, 0, -917486, 2, 0, -851950, 2, 0, -786414, 2, 0, -655342, 2, 0, -589806, 2, 0, -524270, 2, 0, -458734, 2, 0, -393198, 2, 0, -327662, 2, 0, -262126, 2, 0, 524306, 2, 0, 589842, 2, 0, 655378, 2, 0, 720914, 2, 0, 983058, 2, 0, 1048594, 2, 0, -1048557, 2, 0, -983021, 2, 0, -917485, 2, 0, -786413, 2, 0, -720877, 2, 0, -655341, 2, 0, -524269, 2, 0, -458733, 2, 0, 458771, 2, 0, 589843, 2, 0, 655379, 2, 0, 720915, 2, 0, 786451, 2, 0, 851987, 2, 0, 1048595, 2, 0, -983020, 2, 0, -917484, 2, 0, -851948, 2, 0, -786412, 2, 0, -655340, 2, 0, -589804, 2, 0, -458732, 2, 0, -393196, 2, 0, -327660, 2, 0, -262124, 2, 0, -196588, 2, 0, -65516, 2, 0, 65556, 3, 0, 131092, 2, 0, 196628, 2, 0, 262164, 2, 0, 327700, 2, 0, 393236, 2, 0, 458772, 2, 0, 524308, 2, 0, 655380, 2, 0, 786452, 2, 0, 851988, 2, 0, 917524, 2, 0, 983060, 2, 0, 1048596, 2, 0, -983019, 2, 0, -917483, 2, 0, -786411, 2, 0, -720875, 2, 0, -655339, 2, 0, -524267, 2, 0, -458731, 2, 0, -393195, 2, 0, -262123, 2, 0, -196587, 2, 0, -65515, 2, 0, 21, 2, 0, 65557, 2, 0, 196629, 2, 0, 327701, 2, 0, 458773, 2, 0, 524309, 2, 0, 589845, 2, 0, 655381, 2, 0, 720917, 2, 0, 851989, 2, 0, 983061, 2, 0, 1048597, 2, 0, -983018, 2, 0, -917482, 2, 0, -851946, 2, 0, -786410, 2, 0, -720874, 2, 0, -655338, 2, 0, -589802, 2, 0, -458730, 2, 0, -393194, 2, 0, -327658, 2, 0, -262122, 2, 0, -131050, 2, 0, -65514, 2, 0, 22, 2, 0, 196630, 2, 0, 262166, 2, 0, 327702, 2, 0, 393238, 2, 0, 458774, 2, 0, 655382, 2, 0, 720918, 2, 0, 786454, 2, 0, 917526, 2, 0, 983062, 2, 0, 1048598, 2, 0, -1048553, 2, 0, -983017, 2, 0, -917481, 2, 0, -851945, 2, 0, -786409, 2, 0, -720873, 2, 0, -655337, 2, 0, -589801, 2, 0, -524265, 2, 0, -458729, 2, 0, -393193, 2, 0, -327657, 2, 0, -196585, 2, 0, -131049, 2, 0, -65513, 2, 0, 65559, 2, 0, 131095, 2, 0, 196631, 2, 0, 262167, 2, 0, 327703, 2, 0, 393239, 2, 0, 458775, 2, 0, 524311, 2, 0, 589847, 2, 0, 655383, 2, 0, 720919, 2, 0, 851991, 2, 0, 917527, 2, 0, 983063, 2, 0, -1048552, 2, 0, -983016, 2, 0, -851944, 2, 0, -786408, 2, 0, -720872, 2, 0, -655336, 2, 0, -589800, 2, 0, -524264, 2, 0, -458728, 2, 0, -393192, 2, 0, -327656, 2, 0, -196584, 2, 0, -65512, 2, 0, 24, 2, 0, 196632, 2, 0, 262168, 2, 0, 458776, 2, 0, 524312, 2, 0, 589848, 2, 0, 655384, 2, 0, 720920, 2, 0, 786456, 2, 0, 851992, 2, 0, 917528, 2, 0, 983064, 2, 0, 1048600, 2, 0, 851975, 2, 0)

[node name="Camera2D" type="Camera2D" parent="."]
position = Vector2(-1504, -1168)
anchor_mode = 0
zoom = Vector2(0.2, 0.2)

[node name="Player" parent="." instance=ExtResource("3_arfff")]
position = Vector2(-929, 29)

[node name="Goal" parent="." instance=ExtResource("4_r0hbr")]
position = Vector2(865, 32)
