[gd_scene load_steps=5 format=3 uid="uid://c8rylny3b72h"]

[ext_resource type="Script" path="res://scripts/levels/2.gd" id="1_uuc6i"]
[ext_resource type="TileSet" uid="uid://br461uhfv7uy6" path="res://assets/art/kenney/sokoban/tileset.tres" id="2_usxye"]
[ext_resource type="PackedScene" uid="uid://b3lvl2igbda3" path="res://scenes/player.tscn" id="3_1mwan"]
[ext_resource type="PackedScene" path="res://scenes/goal.tscn" id="4_nk6jd"]

[node name="Node2D" type="Node2D"]
script = ExtResource("1_uuc6i")

[node name="TileMap" type="TileMap" parent="."]
tile_set = ExtResource("2_usxye")
cell_quadrant_size = 64
format = 2
layer_0/tile_data = PackedInt32Array(-131077, 3, 0, -65541, 3, 0, -5, 3, 0, 65531, 3, 0, 131067, 3, 0, 196603, 3, 0, 262139, 3, 0, 327675, 3, 0, 393211, 3, 0, 458747, 3, 0, 524283, 3, 0, 524284, 3, 0, 524285, 3, 0, 524286, 3, 0, 524287, 3, 0, 458752, 3, 0, 458753, 3, 0, 458754, 3, 0, 458755, 3, 0, 458756, 3, 0, 458757, 3, 0, 458758, 3, 0, 458759, 3, 0, 393223, 3, 0, 327687, 3, 0, 262151, 3, 0, 196615, 3, 0, 131079, 3, 0, 65543, 3, 0, 7, 3, 0, -65529, 3, 0, -131065, 3, 0, -196601, 3, 0, -131076, 3, 0, -131075, 3, 0, -131074, 3, 0, -131073, 3, 0, -196608, 3, 0, -196607, 3, 0, -196606, 3, 0, -196605, 3, 0, -196604, 3, 0, -196603, 3, 0, -196602, 3, 0, 196604, 3, 0, 262141, 3, 0, 131070, 3, 0, 327679, 3, 0, 0, 3, 0, 196609, 3, 0, 3, 3, 0, 393219, 3, 0, 393220, 3, 0, 131078, 3, 0, 393213, 2, 0, 327677, 2, 0, 327676, 2, 0, 262140, 2, 0, 393212, 2, 0, 458748, 2, 0, 458749, 2, 0, 458750, 2, 0, 393214, 2, 0, 327678, 2, 0, 262142, 2, 0, 196606, 2, 0, 196605, 2, 0, 131069, 2, 0, 65533, 2, 0, -3, 2, 0, -65539, 2, 0, -65540, 2, 0, -4, 2, 0, 65532, 2, 0, 131068, 2, 0, -65538, 2, 0, -2, 2, 0, 65534, 2, 0, 65535, 2, 0, -1, 2, 0, -65537, 2, 0, -131072, 2, 0, -65536, 2, 0, -65535, 2, 0, -131071, 2, 0, -131070, 2, 0, -65534, 2, 0, 2, 2, 0, 1, 2, 0, 65537, 2, 0, 65536, 2, 0, 131071, 2, 0, 196607, 2, 0, 262143, 2, 0, 196608, 2, 0, 131072, 2, 0, 131073, 2, 0, 131074, 2, 0, 65538, 2, 0, 65539, 2, 0, 131075, 2, 0, 196611, 2, 0, 196610, 2, 0, 262146, 2, 0, 262145, 2, 0, 262144, 2, 0, 327680, 2, 0, 393215, 2, 0, 458751, 2, 0, 393216, 2, 0, 393217, 2, 0, 327681, 2, 0, 327682, 2, 0, 393218, 2, 0, 327683, 2, 0, 262147, 2, 0, 262148, 2, 0, 196612, 2, 0, 131076, 2, 0, 65540, 2, 0, 4, 2, 0, -65532, 2, 0, -131068, 2, 0, -131069, 2, 0, -65533, 2, 0, -131067, 2, 0, -65531, 2, 0, 5, 2, 0, 65541, 2, 0, 131077, 2, 0, 196613, 2, 0, 262149, 2, 0, 327685, 2, 0, 327684, 2, 0, 393221, 2, 0, 393222, 2, 0, 327686, 2, 0, 262150, 2, 0, 196614, 2, 0, 65542, 2, 0, 6, 2, 0, -65530, 2, 0, -131066, 2, 0)

[node name="Camera2D" type="Camera2D" parent="."]
position = Vector2(-544, -320)
anchor_mode = 0
zoom = Vector2(0.5, 0.5)

[node name="Player" parent="." instance=ExtResource("3_1mwan")]
position = Vector2(158, 164)

[node name="Goal" parent="." instance=ExtResource("4_nk6jd")]
position = Vector2(-100, 217)
