<mxfile host="Electron" modified="2024-02-03T14:46:27.031Z" agent="Mozilla/5.0 (Windows NT 10.0; Win64; x64) AppleWebKit/537.36 (KHTML, like Gecko) draw.io/22.1.2 Chrome/114.0.5735.289 Electron/25.9.4 Safari/537.36" etag="edJpppkRQCABDJ_qfagz" version="22.1.2" type="device">
  <diagram name="Page-1" id="2YBvvXClWsGukQMizWep">
    <mxGraphModel dx="2402" dy="944" grid="1" gridSize="10" guides="1" tooltips="1" connect="1" arrows="1" fold="1" page="1" pageScale="1" pageWidth="850" pageHeight="1100" math="0" shadow="0">
      <root>
        <mxCell id="0" />
        <mxCell id="1" parent="0" />
        <mxCell id="aM9ryv3xv72pqoxQDRHE-1" value="Main" style="shape=umlLifeline;perimeter=lifelinePerimeter;whiteSpace=wrap;html=1;container=0;dropTarget=0;collapsible=0;recursiveResize=0;outlineConnect=0;portConstraint=eastwest;newEdgeStyle={&quot;edgeStyle&quot;:&quot;elbowEdgeStyle&quot;,&quot;elbow&quot;:&quot;vertical&quot;,&quot;curved&quot;:0,&quot;rounded&quot;:0};" parent="1" vertex="1">
          <mxGeometry x="40" y="40" width="100" height="970" as="geometry" />
        </mxCell>
        <mxCell id="aM9ryv3xv72pqoxQDRHE-5" value="Menu" style="shape=umlLifeline;perimeter=lifelinePerimeter;whiteSpace=wrap;html=1;container=0;dropTarget=0;collapsible=0;recursiveResize=0;outlineConnect=0;portConstraint=eastwest;newEdgeStyle={&quot;edgeStyle&quot;:&quot;elbowEdgeStyle&quot;,&quot;elbow&quot;:&quot;vertical&quot;,&quot;curved&quot;:0,&quot;rounded&quot;:0};" parent="1" vertex="1">
          <mxGeometry x="350" y="40" width="100" height="960" as="geometry" />
        </mxCell>
        <mxCell id="3X0FJbDC4GJmETM9CedO-4" value="Wo willst du hin im Zoo ?&lt;br&gt;Row?" style="html=1;verticalAlign=bottom;endArrow=block;curved=0;rounded=0;strokeColor=default;" parent="1" edge="1">
          <mxGeometry x="0.0526" width="80" relative="1" as="geometry">
            <mxPoint x="280" y="220" as="sourcePoint" />
            <mxPoint x="90" y="220" as="targetPoint" />
            <Array as="points">
              <mxPoint x="180.5" y="220" />
            </Array>
            <mxPoint as="offset" />
          </mxGeometry>
        </mxCell>
        <mxCell id="3X0FJbDC4GJmETM9CedO-5" value="Eingabe:6" style="html=1;verticalAlign=bottom;endArrow=open;dashed=1;endSize=8;curved=0;rounded=0;" parent="1" edge="1">
          <mxGeometry relative="1" as="geometry">
            <mxPoint x="89.5" y="280" as="sourcePoint" />
            <mxPoint x="279.5" y="280" as="targetPoint" />
          </mxGeometry>
        </mxCell>
        <mxCell id="3X0FJbDC4GJmETM9CedO-7" value="Affe" style="shape=umlLifeline;perimeter=lifelinePerimeter;whiteSpace=wrap;html=1;container=0;dropTarget=0;collapsible=0;recursiveResize=0;outlineConnect=0;portConstraint=eastwest;newEdgeStyle={&quot;edgeStyle&quot;:&quot;elbowEdgeStyle&quot;,&quot;elbow&quot;:&quot;vertical&quot;,&quot;curved&quot;:0,&quot;rounded&quot;:0};" parent="1" vertex="1">
          <mxGeometry x="600" y="40" width="100" height="950" as="geometry" />
        </mxCell>
        <mxCell id="3X0FJbDC4GJmETM9CedO-8" value="Attributeaufzählen" style="shape=umlLifeline;perimeter=lifelinePerimeter;whiteSpace=wrap;html=1;container=0;dropTarget=0;collapsible=0;recursiveResize=0;outlineConnect=0;portConstraint=eastwest;newEdgeStyle={&quot;edgeStyle&quot;:&quot;elbowEdgeStyle&quot;,&quot;elbow&quot;:&quot;vertical&quot;,&quot;curved&quot;:0,&quot;rounded&quot;:0};" parent="1" vertex="1">
          <mxGeometry x="480" y="40" width="100" height="930" as="geometry" />
        </mxCell>
        <mxCell id="K4Zt07ZiXetKfcRBEGvm-1" value="Matrix" style="shape=umlLifeline;perimeter=lifelinePerimeter;whiteSpace=wrap;html=1;container=0;dropTarget=0;collapsible=0;recursiveResize=0;outlineConnect=0;portConstraint=eastwest;newEdgeStyle={&quot;edgeStyle&quot;:&quot;elbowEdgeStyle&quot;,&quot;elbow&quot;:&quot;vertical&quot;,&quot;curved&quot;:0,&quot;rounded&quot;:0};" parent="1" vertex="1">
          <mxGeometry x="230" y="40" width="100" height="1010" as="geometry" />
        </mxCell>
        <mxCell id="K4Zt07ZiXetKfcRBEGvm-2" value="Column?" style="html=1;verticalAlign=bottom;endArrow=block;curved=0;rounded=0;strokeColor=default;" parent="1" edge="1">
          <mxGeometry width="80" relative="1" as="geometry">
            <mxPoint x="279.5" y="350" as="sourcePoint" />
            <mxPoint x="90" y="350" as="targetPoint" />
            <Array as="points">
              <mxPoint x="180" y="350" />
            </Array>
          </mxGeometry>
        </mxCell>
        <mxCell id="K4Zt07ZiXetKfcRBEGvm-3" value="Eingabe:4" style="html=1;verticalAlign=bottom;endArrow=open;dashed=1;endSize=8;curved=0;rounded=0;" parent="1" edge="1">
          <mxGeometry relative="1" as="geometry">
            <mxPoint x="90" y="406" as="sourcePoint" />
            <mxPoint x="279.5" y="406" as="targetPoint" />
          </mxGeometry>
        </mxCell>
        <mxCell id="K4Zt07ZiXetKfcRBEGvm-4" value="Actor" style="shape=umlActor;verticalLabelPosition=bottom;verticalAlign=top;html=1;outlineConnect=0;" parent="1" vertex="1">
          <mxGeometry x="-150" y="70" width="30" height="60" as="geometry" />
        </mxCell>
        <mxCell id="K4Zt07ZiXetKfcRBEGvm-7" value="Startet Programm" style="html=1;verticalAlign=bottom;endArrow=block;curved=0;rounded=0;strokeColor=default;" parent="1" target="aM9ryv3xv72pqoxQDRHE-1" edge="1">
          <mxGeometry x="0.4306" width="80" relative="1" as="geometry">
            <mxPoint x="9.5" y="120" as="sourcePoint" />
            <mxPoint x="19.5" y="120" as="targetPoint" />
            <Array as="points">
              <mxPoint x="-110" y="120" />
            </Array>
            <mxPoint x="1" as="offset" />
          </mxGeometry>
        </mxCell>
        <mxCell id="K4Zt07ZiXetKfcRBEGvm-9" value="erstellt Matrix" style="html=1;verticalAlign=bottom;endArrow=block;curved=0;rounded=0;strokeColor=default;" parent="1" target="K4Zt07ZiXetKfcRBEGvm-1" edge="1">
          <mxGeometry x="0.4306" width="80" relative="1" as="geometry">
            <mxPoint x="209.5" y="140" as="sourcePoint" />
            <mxPoint x="290" y="140" as="targetPoint" />
            <Array as="points">
              <mxPoint x="90" y="140" />
            </Array>
            <mxPoint x="1" as="offset" />
          </mxGeometry>
        </mxCell>
        <mxCell id="K4Zt07ZiXetKfcRBEGvm-11" value="erstellt Menu" style="html=1;verticalAlign=bottom;endArrow=block;curved=0;rounded=0;strokeColor=default;" parent="1" edge="1">
          <mxGeometry x="0.0042" width="80" relative="1" as="geometry">
            <mxPoint x="280" y="462" as="sourcePoint" />
            <mxPoint x="399.5" y="462" as="targetPoint" />
            <Array as="points" />
            <mxPoint as="offset" />
          </mxGeometry>
        </mxCell>
        <mxCell id="K4Zt07ZiXetKfcRBEGvm-14" value="erstellt Attributeaufzählen" style="html=1;verticalAlign=bottom;endArrow=block;curved=0;rounded=0;strokeColor=default;" parent="1" edge="1">
          <mxGeometry x="-0.5221" width="80" relative="1" as="geometry">
            <mxPoint x="519.5" y="506" as="sourcePoint" />
            <mxPoint x="529.5" y="506" as="targetPoint" />
            <Array as="points">
              <mxPoint x="400" y="506" />
            </Array>
            <mxPoint as="offset" />
          </mxGeometry>
        </mxCell>
        <mxCell id="K4Zt07ZiXetKfcRBEGvm-15" value="Willkommen beim Affen was willst du über den Affen wissen ?&amp;nbsp;&lt;br&gt;A:Spezialität&amp;nbsp;&lt;br&gt;B: Attribute" style="html=1;verticalAlign=bottom;endArrow=block;curved=0;rounded=0;strokeColor=default;" parent="1" edge="1">
          <mxGeometry width="80" relative="1" as="geometry">
            <mxPoint x="399.49999999999955" y="655" as="sourcePoint" />
            <mxPoint x="90" y="655" as="targetPoint" />
            <Array as="points">
              <mxPoint x="180.5" y="655" />
            </Array>
          </mxGeometry>
        </mxCell>
        <mxCell id="K4Zt07ZiXetKfcRBEGvm-16" value="Eingabe:B" style="html=1;verticalAlign=bottom;endArrow=open;dashed=1;endSize=8;curved=0;rounded=0;" parent="1" edge="1">
          <mxGeometry relative="1" as="geometry">
            <mxPoint x="90" y="700" as="sourcePoint" />
            <mxPoint x="399.5" y="700" as="targetPoint" />
          </mxGeometry>
        </mxCell>
        <mxCell id="K4Zt07ZiXetKfcRBEGvm-17" value="erstellt Affe" style="html=1;verticalAlign=bottom;endArrow=block;curved=0;rounded=0;strokeColor=default;" parent="1" edge="1">
          <mxGeometry x="0.4447" width="80" relative="1" as="geometry">
            <mxPoint x="519.5" y="543.41" as="sourcePoint" />
            <mxPoint x="649.4999999999995" y="543.41" as="targetPoint" />
            <Array as="points">
              <mxPoint x="400" y="543.41" />
            </Array>
            <mxPoint as="offset" />
          </mxGeometry>
        </mxCell>
        <mxCell id="K4Zt07ZiXetKfcRBEGvm-23" value="ruft Methode Attributeaufzähler(Affe Affe1) auf" style="html=1;verticalAlign=bottom;endArrow=block;curved=0;rounded=0;strokeColor=default;" parent="1" edge="1">
          <mxGeometry x="-0.0734" width="80" relative="1" as="geometry">
            <mxPoint x="400" y="756" as="sourcePoint" />
            <mxPoint x="529.5" y="756" as="targetPoint" />
            <Array as="points" />
            <mxPoint as="offset" />
          </mxGeometry>
        </mxCell>
        <mxCell id="K4Zt07ZiXetKfcRBEGvm-24" value="Zeigt Alle Attribute des Affen an:&lt;br&gt;Der Affe wiegt 12 kg&lt;br&gt;Der Affe ist 1.2 m gross&lt;br&gt;Der Affe ist 25 kmh schnell" style="html=1;verticalAlign=bottom;endArrow=open;dashed=1;endSize=8;curved=0;rounded=0;" parent="1" edge="1">
          <mxGeometry x="-0.0483" relative="1" as="geometry">
            <mxPoint x="529.4999999999995" y="910" as="sourcePoint" />
            <mxPoint x="89.25" y="910" as="targetPoint" />
            <mxPoint x="1" as="offset" />
          </mxGeometry>
        </mxCell>
        <mxCell id="K4Zt07ZiXetKfcRBEGvm-26" value="fragt nach Attributen" style="html=1;verticalAlign=bottom;endArrow=block;curved=0;rounded=0;strokeColor=default;" parent="1" edge="1">
          <mxGeometry x="0.0104" y="3" width="80" relative="1" as="geometry">
            <mxPoint x="529.25" y="798" as="sourcePoint" />
            <mxPoint x="649.4999999999995" y="798" as="targetPoint" />
            <Array as="points" />
            <mxPoint x="-1" as="offset" />
          </mxGeometry>
        </mxCell>
        <mxCell id="K4Zt07ZiXetKfcRBEGvm-27" value="schickt&amp;nbsp; Attribute zurück" style="html=1;verticalAlign=bottom;endArrow=open;dashed=1;endSize=8;curved=0;rounded=0;" parent="1" edge="1">
          <mxGeometry x="-0.0483" relative="1" as="geometry">
            <mxPoint x="649.4999999999995" y="862" as="sourcePoint" />
            <mxPoint x="529.25" y="862" as="targetPoint" />
            <mxPoint x="1" as="offset" />
          </mxGeometry>
        </mxCell>
      </root>
    </mxGraphModel>
  </diagram>
</mxfile>
