<?xml version="1.0" standalone="no"?>
<!DOCTYPE svg PUBLIC "-//W3C//DTD SVG 1.1//EN" "http://www.w3.org/Graphics/SVG/1.1/DTD/svg11.dtd">
<svg xmlns="http://www.w3.org/2000/svg">
<metadata>Generated by Fontastic.me</metadata>
<defs>
<font id="wcfont" horiz-adv-x="512">
<font-face font-family="wcfont" units-per-em="512" ascent="480" descent="-32"/>
<missing-glyph horiz-adv-x="512" />

<glyph glyph-name="access" unicode="&#97;" d="M196 22c-27 3-58 12-82 25-103 54-117 170-29 240 12 10 30 21 31 20 1-1 2-9 3-19l1-17-10-9c-29-24-43-53-43-85 0-33 13-60 41-84 21-18 42-28 75-36 18-4 53-4 73 0 52 12 91 41 108 82l4 11 14-18 13-18-6-10c-8-13-24-29-38-40-42-32-98-47-155-42z m251 71c-8 4-5 0-57 72l-21 31-90 0c-100 0-98 0-113 11-16 12-16 12-22 103-4 55-4 57-1 64 4 11 18 22 31 26 18 4 41-1 52-12 10-9 12-15 15-38 1-11 2-21 2-21 0 0 22-1 50-1 54 0 57 0 64-8 8-8 5-19-7-26-4-3-7-3-55-3l-51-1 1-8c1-4 1-11 1-15l0-8 67 0c85 0 77 2 96-25 6-8 18-24 26-35 59-82 56-78 56-86 0-6-1-9-4-12-9-11-26-14-40-8z m-274 318c-14 3-26 11-32 21-4 6-5 8-5 19 0 11 1 13 6 20 9 14 29 22 48 21 34-3 55-29 44-56-4-10-19-21-31-24-10-2-23-3-30-1z"/>
<glyph glyph-name="airpump" unicode="&#98;" d="M294 14c-2 3-4 10-4 15 0 17 4 19 30 19 30 0 34 4 33 28 0 9-1 17-2 16-1 0-4 1-7 2-2 1-13 2-24 2-17 1-19 2-19 9-1 5-4 7-10 9-14 2-28 12-37 24-10 16-16 49-21 113-5 85-16 128-37 145-5 4-20 6-19 2 0-1-2-7-6-13-5-10-6-19-6-141 0-72-1-134-2-140-11-36-37-52-71-41-7 3-14 7-14 8 0 2-1 3-2 2-1-1-6 0-11 4-6 3-14 6-19 6-7-1-12 3-21 12-18 19-18 19-5 31 16 16 22 15 40-4 13-12 15-16 12-20-3-5-2-7 5-11 28-17 41-19 53-6 16 16 16 22 16 160 0 141 1 145 18 163 8 8 12 9 22 9 16 0 29-10 41-31 14-28 20-57 24-115 4-69 9-106 19-122 4-8 21-20 28-20 1 0 2 3 2 6 0 6 7 8 33 9 11 0 17 2 18 5 1 2 2 45 3 95l0 91 12 5 13 4 0 59c0 45-1 59-4 61-2 2-21 4-42 4l-38 1 0 13c0 7 0 14 1 16 1 2 24 3 99 3 107 0 101 1 101-17 0-16 0-16-41-16-34 0-38-1-41-6-2-3-3-27-3-59 0-49 0-55 6-59 3-3 8-5 10-5 3 0 6-2 7-4 1-3 2-66 2-141 0-158-2-146 31-146 28 0 32-3 32-18 0-22 4-21-105-21-93 0-97 0-100 5z"/>
<glyph glyph-name="analytic" unicode="&#99;" d="M31 26c-6 4-6 6-6 74 0 84-3 78 44 78 46 0 43 4 43-79 0-63 0-63-6-70-6-7-7-8-38-8-25 0-33 1-37 5z m128-2c-9 4-9 7-9 127 0 64 0 118 1 120 5 8 14 10 44 10 23 0 32-1 36-5l5-4 0-241-5-5c-4-4-12-5-37-4-17 0-33 1-35 2z m123 2l-6 5 0 93c0 87 1 94 5 99 4 4 10 5 39 5 34 0 36 0 39-7 6-9 6-183 0-192-3-6-7-6-37-7-29-1-36 0-40 4z m125 3l-6 7 0 141c0 123 0 142 3 148 4 6 6 6 40 6 29 0 36-1 40-5 3-4 4-21 4-150l0-145-6-5c-4-4-13-5-37-5-31 0-33 1-38 8z m-354 203c-19 10-28 26-28 48 0 39 35 63 63 45l9-6 28 23 27 23-1 12c-4 30 17 57 44 57 20 0 41-24 41-46 0-8 2-9 23-18l23-9 8 8c15 16 35 19 51 7 7-5 7-4 32 16 14 11 26 21 27 23 1 2 2 11 2 20 1 45 42 68 71 38 10-10 15-21 15-38-1-38-35-63-63-45l-9 6-28-23-27-22 1-13c3-21-9-45-25-53-27-13-61 10-61 42 0 8-1 9-22 18l-23 10-8-9c-15-15-36-18-51-7-3 2-7 4-9 3-1-1-14-11-28-22l-25-21 1-16c0-20-7-36-19-45-11-9-28-12-39-6z m30 31c11 14 8 33-7 40-22 11-41-23-23-42 10-9 20-9 30 2z m244 46c16 7 19 26 7 40-10 11-21 12-29 1-13-15-6-39 13-45 0 0 4 1 9 4z m-119 56c9 10 9 26 0 36-8 10-21 10-30 0-9-11-8-24 1-35 9-11 20-11 29-1z m252 53c13 15 4 43-15 43-9 0-22-14-22-23 0-12 5-22 13-26 10-5 16-3 24 6z"/>
<glyph glyph-name="appleandroid" unicode="&#100;" d="M111 22c-2 1-4 3-4 3 0 1 0 2-1 2-2 0-3 5-2 28 0 16-1 24-2 25-1 1-4 2-11 2-11 0-16 2-21 9-2 3-2 4-3 71l0 67 176 0 0-63c0-42 0-64-1-67-2-8-4-10-9-14-4-3-6-3-15-3-6 0-10-1-11-2-1-1-1-11-2-26l0-26-4-4c-5-4-5-5-13-5-8 0-13 3-16 9-2 3-2 8-3 28l0 25-28 0-1-25-1-26-3-4c-5-7-17-9-25-4z m-79 92c-5 3-7 6-10 11-2 4-2 7-2 48 0 44 0 44 3 49 4 8 9 11 18 10 5 0 7-1 10-4 2-2 5-5 5-8 1-2 1-20 1-50 0-44 0-46-3-49-3-4-11-9-15-9-2 0-5 1-7 2z m231 1c-2 1-6 3-7 5l-4 3 0 48c0 44 0 48 2 52 7 13 25 13 32 0 3-4 3-7 3-45 1-22 0-42 0-46-1-8-5-13-11-17-6-3-8-3-15 0z m152 56c-7 2-19 6-23 9-13 6-30 6-43 0-15-8-30-10-42-6l-7 2-1 23c0 14-1 25-2 27-2 5-10 13-16 15-7 3-16 3-22 0-3-1-5-2-5-2 0 0-1 6-3 12-1 10-3 15-9 28l-7 14-1 15c-1 20 3 38 11 57 10 19 21 31 37 38 11 5 18 7 32 7 14 0 19-1 34-7 15-6 20-7 33-1 13 6 31 11 43 11 17 2 35-5 51-18 11-10 12-11 8-14-12-8-23-22-28-37-3-9-3-11-3-24 0-13 1-17 3-25 6-18 17-31 32-38 5-2 8-3 8-4 0-1-13-27-18-34-6-10-15-23-23-33-8-10-16-14-28-15-5 0-9 0-11 0z m-347 68c-1 2 1 18 3 21 0 1 2 5 3 8 3 7 10 18 18 25 7 6 17 14 19 14 1 0 2 4 0 5-1 1-8 14-11 20-2 4 0 5 2 2 1-1 4-7 7-13 3-6 7-11 7-11 1 0 5 1 8 3 17 6 43 6 59 0 5-1 9-3 10-3 1 0 4 5 7 11 6 12 9 16 10 15 1-1-1-5-9-20-2-4-4-7-4-7 0-1 4-3 8-6 9-6 21-18 26-26 2-4 4-7 4-7 0-1 1-3 2-6 3-6 6-22 5-25-1-2-173-2-174 0z m49 30c6 3 8 9 4 13-3 4-9 4-13 1-3-3-3-9 1-13 4-3 5-3 8-1z m83 1c5 4 4 10 0 14-4 3-8 2-12-2-3-5-2-9 4-13 3-2 4-1 8 1z m165 158c2 21 13 40 31 51 7 5 22 11 29 13l3 1 0-8c-2-14-4-21-8-31-9-18-28-31-50-35l-5-1 0 10z"/>
<glyph glyph-name="atm" unicode="&#102;" d="M19 50l0 33 475 0 0-67-475 0z m5 70c0 4 2 7 3 7 1 0 3 7 3 15 0 8 1 14 2 14 2 0 3 7 3 15 0 8 1 15 2 15 2 0 3 5 3 11 0 6 1 11 3 11 1 0 2 7 2 15 0 8 1 15 3 15 1 0 2 6 2 14 0 8 1 15 3 15 1 0 2 7 2 15 0 8 2 14 3 14 1 0 3 7 3 15 0 8 1 15 2 15 2 0 3 7 3 15 0 8 1 14 2 14 2 0 3 7 3 15 0 8 1 15 2 15 2 0 3 5 3 11 0 6 1 11 3 11 1 0 2 7 2 15 0 8 1 15 3 15 1 0 2 6 2 14 0 8 2 15 3 15 1 0 3 7 3 15l0 14 18 0c16 0 18 0 18-7 0-4 1-7 2-7 2 0 3-7 3-15 0-8 1-15 2-15 2 0 3-6 3-14 0-9 1-15 3-15 1 0 2-5 2-11 0-6 1-11 3-11 1 0 2-7 2-15 0-8 2-15 3-15 1 0 3-6 3-15 0-8 1-14 2-14 2 0 3-7 3-15 0-8 1-15 2-15 2 0 3-6 3-15 0-8 1-14 2-14 2 0 3-5 3-11 0-6 1-11 3-11 1 0 2-7 2-15 0-8 1-15 3-15 1 0 2-6 2-15 0-8 2-14 3-14 1 0 3-7 3-15 0-8 1-15 2-15 2 0 3-5 3-11 0-6 1-11 2-11 2 0 3-7 3-15 0-8 1-14 2-14 2 0 3-2 3-4 0-2-9-4-21-4l-20 0 0 15c0 8-1 15-3 15-1 0-2 6-2 14 0 9-2 15-3 15-1 0-3 7-3 15l0 15-36 0c-34 0-36-1-36-8 0-4-1-7-3-7-1 0-2-7-2-15 0-8-1-15-3-15-1 0-2-6-2-14 0-8-1-15-3-15-1 0-2-3-2-7 0-7-2-8-18-8-17 0-19 1-19 8z m109 158c0 6-1 11-3 11-1 0-2 7-2 15 0 8-1 15-3 15-1 0-2 6-2 14 0 8-2 15-3 15-1 0-3 7-3 15 0 8-1 15-2 15-2 0-3 3-3 7 0 4-1 7-2 7-2 0-3-5-3-11 0-6-1-11-3-11-1 0-2-6-2-15 0-8-1-14-3-14-1 0-2-7-2-15 0-8-1-15-3-15-1 0-2-6-2-15 0-8-2-14-3-14-1 0-3-4-3-8 0-6 2-7 24-7l23 0z m93-7l0 158-52 0 0 66 140 0 0-66-52 0 0-317-36 0z m98 33l0 191 25 0c29 0 32-2 32-27 0-9 1-17 2-17 2 0 3-10 3-22 0-12 1-22 3-22 1 0 2-10 2-22 0-12 1-22 3-22 1 0 2-10 2-22 0-13 1-22 3-22 1 0 3-10 3-23 0-12 1-22 2-22 2 0 3-6 3-14 0-8 1-15 2-15 2 0 3 5 3 11 0 6 1 11 2 11 2 0 3 10 3 22 0 12 1 22 3 22 1 0 2 10 2 22 0 13 1 22 3 22 1 0 2 10 2 23 0 12 1 22 3 22 1 0 2 9 2 22 0 12 2 22 3 22 1 0 3 9 3 20 0 29 2 31 32 31l24 0 0-383-31 0 0 52c0 32 0 51-2 51-2 0-3 31-3 85 0 54-1 85-2 85-2 0-3-10-3-22 0-12-1-22-2-22-2 0-3-11-3-26 0-15-1-26-3-26-1 0-2-10-2-22 0-12-1-22-3-22-1 0-2-11-2-26 0-15-1-26-3-26-1 0-3-10-3-22 0-12-1-22-2-22-2 0-3-8-3-18l0-19-36 0 0 22c0 13-1 22-2 22-2 0-3 10-3 23 0 12-1 22-3 22-1 0-2 11-2 25 0 15-1 26-3 26-1 0-2 10-2 22 0 13-1 22-3 22-1 0-2 10-2 23 0 12-2 22-3 22-2 0-3 11-3 25 0 15-1 26-2 26-2 0-3-49-3-140l0-140-36 0z"/>
<glyph glyph-name="carwash" unicode="&#101;" d="M25 21l-9 7 0 178 29 68c17 41 31 70 35 73 14 13 15 13 176 13 162 0 163-1 176-13 3-3 19-37 35-74l29-68 0-85c0-108 0-106-43-106-22 0-23 0-31 7-6 6-7 10-7 21l0 15-317 0-2-16c-1-14-2-17-9-22-7-5-11-5-31-5-21 0-23 0-31 7z m100 103c12 4 17 9 21 20 12 26-24 51-55 38-27-11-27-45 0-57 12-5 21-5 34-1z m301 4c16 13 19 25 11 40-8 12-20 18-39 17-12-1-16-3-24-10-19-16-15-37 8-49 13-7 32-6 44 2z m15 103c-1 2-10 24-21 49l-19 46-292 0-18-43c-9-24-18-46-19-49l-2-6 186 0c148 0 186 1 185 3z m-337 176c-29 14-27 35 6 73l12 14 7-7c13-13 28-33 31-45 4-10 4-12-3-22-11-16-34-22-53-13z m132 0c-28 14-24 45 12 77l8 8 9-8c13-13 30-40 30-50 0-24-34-39-59-27z m131 0c-10 6-18 17-18 29 0 8 14 30 28 46l11 12 11-11c17-19 28-37 28-49 0-25-33-39-60-27z"/>
<glyph glyph-name="imarketing" unicode="&#104;" d="M50 19c-26 1-28 2-31 11-1 5-1 78 0 94 3 21 6 40 8 43 3 5 10 7 15 5 1-1 10-9 19-18l16-16 8 6c12 9 36 30 36 31 0 1-1 4-3 8-6 10-12 25-16 40-1 5-1 14-1 34 0 26 0 29 2 37 4 15 10 29 16 38 1 3 2 5 2 6 0 2-17 16-34 30l-10 7-16-16c-9-9-18-17-19-18-5-3-12-1-15 4-2 3-5 23-8 43 0 7-1 29-1 51 0 48 0 50 10 53 7 2 79 2 95 0 21-2 40-5 43-7 5-3 7-10 5-15-1-2-9-10-18-19l-16-17 6-8c10-13 30-36 32-36 0 0 5 2 10 5 13 6 24 10 42 13 10 2 43 2 54 0 20-5 38-11 52-20 2-1 3-1 5 1 1 2 6 8 12 15 5 6 13 16 17 21l7 9-16 17c-9 9-17 17-18 19-3 5-1 12 4 15 3 2 23 5 43 7 16 2 89 2 95 0 10-3 10-5 11-53 0-22-1-44-2-51-2-20-5-40-7-43-3-5-10-7-16-4-1 1-9 9-18 18l-17 16-9-8c-6-4-11-8-11-8-1-1-8-7-15-13-6-6-12-11-12-11 0-1 2-6 5-11 9-18 12-32 15-56 3-24-4-59-17-83-3-4-4-8-4-8 0-1 25-21 38-32l10-7 17 16c9 9 17 17 18 18 6 2 13 0 16-5 2-3 5-22 7-42 2-17 2-90 0-96-3-9-5-10-53-10-22 0-44 1-51 1-20 3-40 6-43 8-5 3-7 10-4 15 1 1 9 10 18 19l16 16-3 5c-5 7-14 17-26 30l-11 13-11-6c-6-3-13-6-17-8-7-3-27-8-31-8-2 0-4 0-4-1-1-1-36-1-36 0 0 1-3 1-7 2-13 1-28 6-44 14-5 3-10 4-10 4-2 0-15-16-30-35l-7-10 16-16c9-9 17-18 18-19 2-5 0-12-5-15-3-2-24-6-44-8-16-1-44-2-72-1z m296 169l3 4 0 130-6 7-172 0-3-3c-2-2-3-4-4-6 0-1 0-30 0-65l0-63 4-4 3-4 172 0z m-164 9c0 1 32 30 49 45l9 7 6-2c6-2 17-2 22 0 2 1 4 2 5 2 1 0 10-8 32-27 6-6 14-14 18-17 5-4 8-8 8-8 0-2-14-2-75-2-61 0-74 0-74 2z m139 26c-8 8-19 17-24 21-4 4-9 8-10 9-1 1-2 2-2 3 0 1 7 7 23 22 3 2 23 20 26 23 2 2 3 3 4 3 0 0 1-21 1-47 0-37-1-47-2-47 0 0-8 6-16 13z m-146 35c0 27 1 48 1 49 1 0 7-5 35-32 10-10 18-18 18-19 0-1-16-15-44-39-4-3-8-6-9-6-1 0-1 15-1 47z m75-1c-4 2-6 4-24 21-8 7-19 17-26 24-13 11-15 13-15 15 0 0 33 0 73 0 43 0 72 0 72-1 0-1 1 0-33-31-17-14-32-27-34-28-4-2-8-1-13 0z"/>
<glyph glyph-name="responsive" unicode="&#105;" d="M164 25c-6 3-9 6-11 12-3 8-2 20 2 25 6 9 9 10 25 11l14 0 0 53-70 1c-67 1-69 1-75 4-10 5-15 11-20 25-2 6-2 298 0 306 2 7 8 16 12 20 2 2 7 4 11 6l6 3 399 0 7-3c8-4 13-8 17-15 6-10 6-13 6-57l0-40-5 3c-6 4-19 9-23 9l-3 0 0 32c0 32 0 32-3 35l-2 2-387 0-2-3-3-3 0-142c0-141 0-143 2-146 3-2 4-2 84-2l82 0 0-53c0-58 0-59 7-76 3-4 4-9 4-9 0 0-15-1-35-1-30 0-35 1-39 3z m122 0c-10 3-16 7-23 17-7 10-7 5-7 149l0 132 3 7c4 10 12 18 20 22l7 4 86 0c95 0 89 0 100-8 5-4 12-15 14-22 1-4 1-19 1-48 0-37 0-42-1-41-3 3-14 5-22 5l-8 0 0 37c0 35 0 37-2 40l-3 2-160 0-2-3c-1-2-1-16-1-118l0-115 34 0 34-1 0-24c0-23 0-24 4-30l3-6-36 0c-24 0-37 0-41 1z m100 3c-2 1-5 4-8 6l-4 5 0 78c0 42 0 81 0 85 1 7 2 9 5 13 6 8 11 8 55 8l38-1 6-3c10-6 9-1 9-96 0-82 0-84-3-87-1-2-5-5-7-7-6-3-7-3-46-3-32 0-42 1-45 2z m50 12c5 4 2 13-5 13-5 0-7-2-7-7 0-7 6-10 12-6z m28 91l0 65-33 1-33 0 0-132 33 0 33 1z"/>
<glyph glyph-name="restaurant" unicode="&#106;" d="M123 129l-1 106-12 2c-32 5-64 30-75 58-6 13-6 19-6 105l0 91 50 0 0-164 50 0 0 164 50 0 0-164 53 0 0 164 51 0-1-94-1-95-8-14c-16-28-42-47-72-51l-12-2-1-106 0-106-64 0z m301-12l0 93-64 0 0 98c0 59 2 102 3 108 10 33 61 69 107 74l16 1 0-468-62 0z"/>
<glyph glyph-name="route" unicode="&#107;" d="M430 306c-2 0-3 2-4 4-1 0-1 1-2 2-1 2-2 3-2 4 0 1-1 1-1 2-2 3-2 4-3 5-1 1-1 2-2 3-1 1-1 2-2 3 0 1-1 2-1 3 0 0-1 1-1 2-1 0-3 4-3 5 0 0-1 1-2 2 0 1-2 4-3 7-2 3-3 5-4 6 0 0-1 2-1 3-1 1-2 3-2 3 0 0-1 1-2 2-1 2-1 3-2 4 0 0-1 2-1 3-1 1-2 2-2 2 0 0 0 1 0 1 0 0-1 2-2 3 0 1-1 2-1 2 0 1-1 3-2 4-1 2-2 3-2 3 0 1-1 2-1 3-1 0-1 2-2 2 0 1-1 2-1 2 0 0 0 1-1 1 0 0 0 2-1 3-3 5-5 9-6 15-1 0-1 1-1 2 0 0 0 1 0 2-1 1-1 2-1 3 0 0 0 2-1 3 0 4 0 12 0 15 1 2 1 4 1 4 0 3 2 9 3 12 1 2 3 6 3 6 0 0 0 1 1 2 0 1 1 2 1 3 1 0 1 1 1 1 0 0 1 0 1 1 0 0 1 1 1 2 5 6 11 12 17 16 4 2 8 5 12 6 3 1 7 2 9 3 0 0 1 0 2 0 3 1 6 1 12 1 6 0 8 0 12-1 1 0 2 0 3 0 1-1 6-2 8-3 0 0 1 0 2-1 7-3 14-8 20-13 4-4 8-9 11-14 1-2 3-7 3-8 3-7 4-10 5-17 0-2 0-13 0-15-2-10-4-16-9-25 0-1-2-3-2-4 0-1-1-1-1-2 0 0-1-1-1-2-1-2-3-4-4-6-1-2-2-3-2-4 0 0 0 0 0-1-1-1-3-4-3-5-1 0-1-1-1-1 0-1-3-5-3-5 0-1-1-1-1-2 0 0-1-1-2-3-1-2-2-3-2-4-1-1-1-2-2-5-1-1-3-5-4-5 0-1-2-4-3-6-1-1-2-3-4-7-2-3-3-5-3-6-1 0-1-1-1-1 0 0-1-2-2-3-1-2-1-3-2-3 0-1 0-1 0-2-1 0-1-1-2-2 0 0-1-1-1-2 0 0 0-1-1-2 0 0-1-2-1-2-1-1-2-3-3-4-2 0-4-1-6 0z m7 88c3 1 7 2 8 3 0 0 0 0 1 0 1 1 3 3 5 4 4 4 7 8 8 13 2 4 2 9 1 13-1 6-3 11-8 16-2 2-4 4-7 5-5 2-8 3-13 3-4 0-7 0-11-2-3-1-7-4-10-7-2-2-4-6-6-9 0-1-1-4-1-6-1-2-1-7 0-9 0 0 0-1 0-1 0-1 1-4 2-6 2-6 8-11 14-14 2-2 4-2 9-3 1 0 5 0 8 0z m-353-350c-2 1-3 2-4 4-1 1-1 2-2 3-1 2-2 3-2 4 0 0-1 1-1 2-2 2-2 3-3 4-1 2-1 3-2 4 0 1-1 1-2 3 0 0-1 1-1 2 0 1-1 2-1 2-1 1-3 5-3 6 0 0-1 1-1 2-1 1-3 4-4 7-2 2-3 5-4 5 0 1-1 2-1 3-1 2-2 3-2 4 0 0-1 1-2 2-1 2-1 3-2 4 0 0-1 1-1 2-1 2-2 3-2 3 0 0 0 0 0 1 0 0-1 1-2 2 0 1-1 3-1 3 0 1-1 2-2 4-1 1-2 3-2 3 0 0-1 1-1 2-1 1-1 2-2 3 0 0-1 1-1 2 0 0 0 0 0 1-1 0-1 1-2 2-3 6-5 9-6 15-1 1-1 2-1 2 0 1 0 2 0 2-1 1-1 2-1 3 0 1 0 2-1 4 0 3 0 11 0 15 1 1 1 3 1 4 0 3 2 9 3 12 1 1 3 5 3 6 0 0 0 1 1 1 0 1 1 2 2 3 0 1 0 1 0 2 0 0 1 0 1 0 0 1 1 2 1 3 5 6 11 11 17 16 4 2 8 4 12 5 3 2 7 3 9 3 0 0 1 1 2 1 3 0 6 1 12 1 6 0 8-1 12-1 1 0 2-1 3-1 1 0 7-2 8-2 0 0 1-1 2-1 7-3 14-8 20-13 4-4 8-10 11-15 1-1 3-6 4-7 2-8 3-11 4-18 0-2 0-13 0-15-2-9-4-16-8-24-1-2-2-4-3-4 0-1-1-2-1-2 0 0-1-1-1-3-1-1-3-4-4-5-1-2-2-4-2-4 0-1 0-1 0-1-1-1-3-5-3-5-1-1-1-1-1-2 0 0-3-4-3-5 0 0 0-1-1-1 0 0-1-2-2-4 0-1-2-3-2-4 0-1-1-2-2-4-1-1-3-5-4-6 0 0-2-3-3-5-1-2-2-3-4-8-1-2-3-4-3-5-1-1-1-1-1-2 0 0-1-1-2-3-1-1-1-2-2-3 0 0 0-1 0-1-1-1-1-2-2-2 0-1 0-2-1-2 0 0 0-1-1-2 0-1-1-2-1-3-1-1-2-2-3-3-2-1-4-1-6-1z m7 89c3 0 7 2 8 2 0 1 1 1 1 1 1 0 4 2 5 3 4 5 7 8 8 13 2 5 2 9 1 13-1 7-3 12-8 16-2 3-4 4-7 6-5 2-8 3-13 3-4 0-7-1-11-2-3-2-7-4-10-7-2-2-4-7-6-10 0-1-1-4-1-5-1-3-1-8 0-9 0-1 0-1 0-2 0 0 1-3 2-5 2-6 8-12 14-15 2-1 4-2 9-2 2-1 5-1 8 0z m352 167l-358-261 12-17 358 262z"/>
<glyph glyph-name="spider" unicode="&#108;" d="M219 26c-25 25-46 77-55 138-6 39-10 115-7 124 1 3 2 3 5 3 4-1 6 0 14 5 5 3 11 7 11 8 1 1 2 1 3 1 1 0 4 2 7 4 3 2 7 5 9 6 2 1 3 3 3 3-1 0-8 0-16 0-10-1-16-2-22-5-14-5-97-56-113-70l-6-5 0-21c0-41 9-77 28-119 4-8 7-16 7-16 1-1 1-2 0-2-1 0-14 20-24 38-24 40-37 87-37 128 0 12 0 13 2 13 6-2 14-2 20 0 6 2 26 13 52 28 18 11 25 16 47 31l15 11 14 0c14-1 38 1 38 2 0 2-13 7-21 8-26 4-83-6-112-20l-7-3-4 2c-3 2-10 6-15 10l-11 7 2 4c1 2 4 13 7 24 7 32 18 56 38 86 14 21 28 39 30 39 1 0-2-7-7-14-10-15-22-40-29-63-6-20-11-50-11-66l0-9 5 1c13 2 79 14 87 16 12 3 17 3 30-1 13-5 18-6 18-4 0 1-7 10-11 12-2 2-5 2-34 2l-31 0-8-3c-9-4-7-4-21 5l-7 5 4 14c5 15 12 35 22 55 7 14 27 50 29 52 2 1 1-3-2-12-15-37-26-76-26-97l0-8 7-1c16-1 52 1 63 3 3 1 6-1 16-8 7-5 13-9 14-9 0 0 1 0 1 1 0 1 1 3 2 5 3 3 12 7 13 6 1 0 0-2-2-5-4-4-5-10-2-10 0 0 2 1 4 2 2 2 3 2 6 1 3-2 9-2 13 0 2 1 3 2 5 0 2-1 2 0 4 1 2 1 2 2-2 6-2 3-3 5-2 5 0 1 7-2 11-5 2-1 3-3 4-5 1-3 2-3 4-1 1 1 6 5 12 9l11 7 11-1c12-2 54-3 59-2l4 1-1 12c-1 25-10 56-23 88-4 8-6 15-6 16 0 4 4-1 13-16 12-21 21-41 31-65 16-39 16-40 1-47-4-2-7-4-7-5 0 0-1 0-3 1-7 3-12 4-44 5-26 0-31 0-32-1 0-1-2-1-3-1-2 0-4-2-7-6-2-4-4-7-4-7 0-1 4 0 16 4 7 3 14 5 17 5 2 0 10-2 17-3 18-5 62-13 87-17 3-1 3-1 3 11 0 10-3 29-7 49-2 11-10 34-16 46-5 9-16 30-23 42-1 1-1 1 0 1 1 0 5-4 9-9 28-31 50-77 58-116 2-10 4-19 6-21 1-1 2-3 2-4 0 0-6-4-14-9l-14-10-12 5c-30 12-60 18-86 19-19 1-28 0-37-5l-7-3 4-1c6-2 23-4 36-3l13 1 22-16c23-17 45-30 73-44 27-14 29-14 37-11l4 1 0-13c0-14-3-36-6-52-5-23-19-57-33-81-7-11-24-39-25-40-2-1-1 2 4 11 22 42 33 87 34 136 1 19 0 20-12 28-22 15-54 35-78 49-9 5-19 11-23 14-3 2-7 4-9 4-5 2-35 5-36 4-1-1 17-13 32-22 11-6 13-7 17-6l5 0-1-44c-1-45-2-64-8-94-7-39-19-73-35-101-6-9-17-24-19-24-1 0-1 0 4 9 14 24 23 55 29 95 2 14 3 26 3 63-1 26-1 52-2 60-2 13-2 14 1 16 6 4 2 10-15 23-15 11-28 18-28 15 0-3 4-11 8-14 3-4 3-5 3-11 0-8-5-30-10-45-7-20-23-52-27-53 0 0-1 1-2 3-1 4-4 3-5-1l-1-3-2 4c-13 17-25 45-32 76-5 18-4 24 2 32 12 17-1 14-24-5-7-5-14-11-15-13-3-4-3-4 1-6l3-3-2-20c-2-29-1-99 2-119 6-43 17-78 33-100 6-8 6-10 0-5z"/>
<glyph glyph-name="surau" unicode="&#109;" d="M272 500c-6 0-19-1-24-3-24-6-43-26-50-52-2-9-2-25 0-34 7-25 25-44 49-51-6-1-13-4-24-11-12-6-24-12-27-12-11 0-54-15-74-26-39-21-62-44-78-76-8-17-10-25-10-49 0-25 2-32 10-49 6-11 12-22 13-25 2-4-1-4-17-4l-20 0 0-98 475 0 0 98-17 0c-9 0-17 1-17 2 0 1 4 8 8 15 4 6 10 21 13 32 21 73-37 146-138 175-16 5-37 13-47 19-6 3-10 6-14 7 10 2 19 7 28 13 9 7 20 21 19 22 0 0-5-2-9-6-5-4-11-8-14-9-30-11-62 2-77 30-6 11-8 20-7 33 1 17 6 30 19 42 7 7 12 10 24 14 5 1 9 2 9 3 0 0-1 0-3 0z m24-12c0 0 0 0 0 0-1-2-3-9-5-16l-5-13-18 0-18-1 14-10c8-5 14-11 14-11 0-1-2-9-5-18-6-18-8-18 13-3l11 7 14-10c8-5 14-9 14-9 1 0-2 7-5 16-3 8-5 16-5 17 0 0 7 6 15 11l15 10-18 1-18 0-6 16c-3 8-6 13-7 13z"/>
<glyph glyph-name="tng" unicode="&#111;" d="M223 21c-6 11-6 39 2 117 5 58 7 69 16 84 11 17 13 18 61 16 54-2 51 1 46-46-2-16-4-16-44-16l-41 0-4-41c-3-23-5-47-6-53-1-11 2-13 22-12 13 1 25 4 27 7 3 2 5 18 7 34 2 29 2 29 17 29 9 0 17-2 18-5 1-3-1-27-3-52-8-67-11-71-68-71-31 0-47 3-50 9z m132 3c-7 14-7 15 2 107 10 102 11 104 59 107 69 5 72-1 63-104-7-81-11-106-20-115-4-4-27-7-52-7-37 0-47 3-52 12z m88 91c7 64 8 61-22 61l-26 0-5-46c-6-65-7-62 22-59l27 2z m-333 30c4 42 8 81 8 86 3 13 31 11 34-2 1-8 3-9 9-3 11 11 51 5 55-8 2-8 2-33-3-81l-6-69-13 3c-13 2-14 4-14 23 0 12 2 35 3 51l3 31-39 0-5-54-4-53-35 0z m-20 57c1 15 3 29 4 32 2 7 15 7 15 0 0-7-18-58-20-58-1 0-1 12 1 26z m190 64c-3 2-7 8-10 14-4 10-5 10-11 0-5-9-13-12-31-12-30 0-32 6-26 78 9 87 8 83 22 86 7 2 14 1 15-2 1-2-1-27-4-55-2-28-4-52-3-54 1-2 10-3 20-3l17 0 4 40c8 78 6 73 22 73 8 0 15-3 15-6 0-7-10-113-13-140-2-17-8-24-17-19z m-242 18c3 26 13 141 13 152 0 6-5 9-18 9l-19 0 1 27 1 26 59 2 59 2-3-26-2-27-20-2c-24-3-21 7-31-106l-6-73-18 0c-17 0-18 1-16 16z m60-5c-4 9-4 22 1 72 4 33 8 65 11 70 6 15 82 14 85-1 4-19-8-133-15-143-10-14-76-12-82 2z m64 61c4 39 3 41-14 41-15 0-16-1-18-22-4-39-4-41 13-41 15 0 16 1 19 22z m151-61c-3 8-4 21 0 65 7 85 8 87 50 87 34 0 35 0 33-16-2-9-3-20-3-25 0-6-7-9-23-9-23 0-23 0-25-22-5-42-4-43 18-41 15 2 21 0 21-6 0-5-1-17-1-26-1-18-1-18-33-18-24 0-33 2-37 11z m81 1c0 7 4 59 10 116l10 102 12 0c18 0 20-4 15-43-4-37-3-46 4-32 3 4 15 8 28 8 28 0 29-4 23-77-8-89-7-87-20-85-11 2-12 5-12 27 1 14 2 37 3 52l2 26-35 0-4-53-5-53-16 0c-13 0-16 2-15 12z"/>
<glyph glyph-name="toilet" unicode="&#112;" d="M241 19c-2 2-3 27-3 237 0 211 1 235 3 238 4 4 11 4 15 0 3-4 3-23 3-238 0-224 0-234-3-237-5-4-11-4-15 0z m114 9c-3 1-6 5-9 9-4 7-4 9-4 70l-1 63-4 0c-6 0-11 6-12 14 0 5 4 27 13 68 17 77 16 73 11 73-2 0-4-1-5-3-1-1-8-20-15-42-7-21-15-41-17-44-8-9-21-7-28 3-6 10-5 22 10 65 8 22 16 45 18 51 2 6 6 14 10 18l6 6 116 0 5-5c3-2 6-8 8-12 6-11 36-102 36-107 0-3-2-8-4-13-6-15-23-16-30-3-2 3-10 23-17 44-7 21-13 38-14 40-1 2-10 3-10 1 0-2 4-18 24-102 4-16 8-32 8-35 0-8-4-15-11-17l-6-2 0-61c0-46-1-61-3-66-7-18-24-20-34-4-4 7-4 8-4 70 0 61 0 63-4 63-3 0-4-2-4-63-1-69-1-72-13-79-6-3-10-3-16 0z m-292 7c-1 3-2 51-2 144 0 139 0 140-4 140-3 0-4-1-4-56 0-52 0-57-3-62-7-12-18-12-25-1-3 6-3 11-3 86l0 80 9 12 162 0 5-5 4-5 1-80c0-70 0-81-3-86-6-12-19-13-25-2-4 6-4 11-4 63 0 54 0 56-4 56-3 0-3-2-3-140 0-76-1-141-1-143-2-4-3-5-17-5-9 0-16 1-17 3-2 1-3 21-3 75l0 73-28 0 0-73c0-54 0-74-2-75-1-2-8-3-17-3-12 0-15 1-16 4z m37 363c-4 2-10 6-15 9-20 19-22 49-3 68 18 19 42 19 60-1 8-8 10-12 12-20 3-17 0-31-11-43-10-12-28-17-43-13z m272 1c-35 14-39 67-6 85 37 20 76-21 59-61-5-12-14-19-26-24-9-3-17-3-27 0z"/>
<glyph glyph-name="distance" unicode="&#113;" d="M83 44c-28 33-55 87-58 117-3 31 7 52 34 74 52 43 132 1 132-68 0-36-62-145-82-145-3 0-15 10-26 22z m64 80c29 29 21 77-17 96-15 8-21 9-35 4-39-13-56-59-34-92 20-30 61-33 86-8z m14-74c0 10 6 18 20 30 23 19 36 19 38 0 1-10-3-16-18-28-25-20-40-20-40-2z m70 47c-10 10-6 20 14 37 23 19 36 19 38 1 1-10-3-17-18-29-21-17-25-18-34-9z m66 56c-7 8-2 22 15 36 20 18 38 19 40 2 3-18-43-50-55-38z m64 54c-9 9-2 26 18 41 39 30 60 6 23-26-20-17-34-22-41-15z m37 94c-46 51-65 122-42 153 35 47 92 47 127-1 17-23 14-62-9-104-20-37-45-71-52-71-2 0-13 10-24 23z m48 66c18 11 30 35 27 55-2 7-11 20-20 29-16 13-21 15-38 12-14-2-24-7-34-18-15-17-17-36-5-61 13-28 41-35 70-17z"/>
<glyph glyph-name="technetium" unicode="&#110;" d="M67 495l362 0 0-10-362 0z m383-5c0-7-6-14-14-14-7 0-13 7-13 14 0 8 6 14 13 14 8 0 14-6 14-14z m-191-75l10 0 0-385-10 0z m19-392c0-8-7-14-14-14-8 0-14 6-14 14 0 7 6 13 14 13 7 0 14-6 14-13z m38 25c0-8-6-14-14-14-7 0-14 6-14 14 0 7 7 13 14 13 8 0 14-6 14-13z m-99 362l-103 0 0 10 113 0 0-322-10 0z m19-319c0-8-6-14-14-14-7 0-14 6-14 14 0 7 7 13 14 13 8 0 14-6 14-13z m-223 366l363 0 0-9-363 0z m384-4c0-8-6-14-14-14-7 0-14 6-14 14 0 7 7 13 14 13 8 0 14-6 14-13z m-100-33l181 0 0-10-171 0 0-356-10 0z m202-5c0-8-6-14-14-14-8 0-14 6-14 14 0 8 6 14 14 14 8 0 14-6 14-14z"/>
</font></defs></svg>
