/*!*****************************!*\
  !*** ./GLS-admin.js ***!
  \*****************************/

/*!********************************!*\
  !*** ./js/GLS-utils.js ***!
  \********************************/

/*!************************************!*\
  !*** ./scss/GLS-admin.scss ***!
  \************************************/

/*!*********************************************!*\
  !*** ./js/GLS-woo-commerce-admin.js ***!
  \*********************************************/

/*!************************************************!*\
  !*** ./js/GLS-weight-based-shipping.js ***!
  \************************************************/

/*!***************************************************!*\
  !*** ./node_modules/popper.js/dist/esm/popper.js ***!
  \***************************************************/
