{
  "type": "minecraft:crafting_shaped",
  "pattern": [
    "@@@",
    " | ",
    " | "
  ],
  "key": {
    "|": {
      "item": "minecraft:stick"
    },
    "@": {
      "item": "minecraft:diorite"
    }
  },
  "result": {
    "item": "igneouslife:diorite_pickaxe"
  }
}