{
  "type": "minecraft:crafting_shaped",
  "pattern": [
    "@@",
    " |",
    " |"
  ],
  "key": {
    "|": {
      "item": "minecraft:stick"
    },
    "@": {
      "item": "minecraft:polished_granite"
    }
  },
  "result": {
    "item": "igneouslife:polished_granite_hoe"
  }
}