{
  "type": "minecraft:crafting_shaped",
  "pattern": [
    "@@",
    "@|",
    " |"
  ],
  "key": {
    "|": {
      "item": "minecraft:stick"
    },
    "@": {
      "item": "minecraft:granite"
    }
  },
  "result": {
    "item": "igneouslife:granite_axe"
  }
}