{
  "type": "minecraft:crafting_shaped",
  "pattern": [
    "@",
    "|",
    "|"
  ],
  "key": {
    "|": {
      "item": "minecraft:stick"
    },
    "@": {
      "item": "minecraft:andesite"
    }
  },
  "result": {
    "item": "igneouslife:andesite_shovel"
  }
}