{
  "parent": "block/block",
  "textures": {
    "side": "block/polished_granite",
    "particle": "block/polished_granite",
    "top": "block/polished_granite",
    "bottom": "block/polished_granite"
  },
  "elements": [
    {
      "from": [
        0,
        0,
        0
      ],
      "to": [
        16,
        15,
        16
      ],
      "faces": {
        "down": {
          "texture": "#bottom",
          "cullface": "down"
        },
        "up": {
          "texture": "#top"
        },
        "north": {
          "texture": "#side",
          "cullface": "north"
        },
        "south": {
          "texture": "#side",
          "cullface": "south"
        },
        "west": {
          "texture": "#side",
          "cullface": "west"
        },
        "east": {
          "texture": "#side",
          "cullface": "east"
        }
      }
    }
  ]
}